569 UXY


569UXY is registered to a Black 1956, Morris with a Petrol engine. It Failed its most recent MOT Test on the 23 February 2012

23 unique faults (24 Total) reported in its MOT History (8 Tests).

1 common/recurring faults.

62% (5) MOT Pass Rate and a 38% (3) MOT Failure Rate.

66,796 recorded miles.

569 UXY


569UXY is registered to a Black 1956, Morris with a Petrol engine. It Failed its most recent MOT Test on the 23 February 2012

23 unique faults (24 Total) reported in its MOT History (8 Tests).

1 common/recurring faults.

62% (5) MOT Pass Rate and a 38% (3) MOT Failure Rate.

66,796 recorded miles.

MOT PASS/Failure rate for 569 UXY

all MOT test results for 569 UXY represented as a percentage
MOT PASS/Failure rate for 569 UXY
all MOT test results for 569 UXY represented as a percentage

PERCENTAGE OF VEHICLE FAULTS WITH 569 UXY

ALL REPORTED FAULTS, DISPLAYED BY PERCENTAGE OF OCCURRENCE DURING ALL MOT TESTS
PERCENTAGE OF VEHICLE FAULTS WITH 569 UXY
ALL REPORTED FAULTS, DISPLAYED BY PERCENTAGE OF OCCURRENCE DURING ALL MOT TESTS
ADVISORY

FAIL

USER ENTERED

569 UXY annual Faults by type

ALL REPORTED FAULTS, DISPLAYED over time and categorised by type
569 UXY annual Faults by type
ALL REPORTED FAULTS, DISPLAYED over time and categorised by type

ALL 569 UXY ADVISORIES [2]

ALL ADVISORIES, ORDERED by OCCURRENCE DURING 569 UXY's MOT HISTORY
ALL 569 UXY ADVISORIES [2]
ALL ADVISORIES, ORDERED by OCCURRENCE DURING 569 UXY's MOT HISTORY
Advisory Faults | source www.vehiclestats.co.uk
Fault Fault Test Date Test Date/Time Reference MOT Test Reference
2 Nearside steering rack gaiter deteriorated (2.2.d.2d) Nearside steering rack gaiter deteriorated (2.2.d.2d) 23 February 2012 [08:13] 23/02/2012 22 February 2012 [15:55] 22/02/2012 705994952053 705994952053 736563152091 736563152091

ALL 569 UXY Failure Faults [20]

ALL Failure faults, ORDERED by OCCURRENCE DURING 569 UXY's MOT HISTORY
ALL 569 UXY Failure Faults [20]
ALL Failure faults, ORDERED by OCCURRENCE DURING 569 UXY's MOT HISTORY
Fail Faults | source www.vehiclestats.co.uk
Fault Fault Test Date Test Date/Time Reference MOT Test Reference
1 Front headlamp not working on main beam (1.7.5a) Front headlamp not working on main beam (1.7.5a) 22 February 2012 [15:55] 22/02/2012 736563152091 736563152091
1 Front front brake application uneven (3.7.b.2) Front front brake application uneven (3.7.b.2) 22 February 2012 [15:55] 22/02/2012 736563152091 736563152091
1 Fuel cap/sealing device sealing washer missing (7.2.4c) Fuel cap/sealing device sealing washer missing (7.2.4c) 22 February 2012 [15:55] 22/02/2012 736563152091 736563152091
1 Brakes imbalanced across an axle (3.7.b.5b) Brakes imbalanced across an axle (3.7.b.5b) 22 February 2012 [15:55] 22/02/2012 736563152091 736563152091
1 Registration plate lamp not working (1.1.c.1d) Registration plate lamp not working (1.1.c.1d) 01 September 2009 [10:53] 01/09/2009 373424649462 373424649462
1 Front windscreen wiper does not clear the windscreen effectively (8.2.2) Front windscreen wiper does not clear the windscreen effectively (8.2.2) 01 September 2009 [10:53] 01/09/2009 373424649462 373424649462
1 Windscreen washer provides insufficient washer liquid (8.2.3) Windscreen washer provides insufficient washer liquid (8.2.3) 01 September 2009 [10:53] 01/09/2009 373424649462 373424649462
1 Nearside front seat belt locking mechanism does not secure or release (5.2.5a) Nearside front seat belt locking mechanism does not secure or release (5.2.5a) 01 September 2009 [10:53] 01/09/2009 373424649462 373424649462
1 Offside front seat belt locking mechanism does not secure or release (5.2.5a) Offside front seat belt locking mechanism does not secure or release (5.2.5a) 01 September 2009 [10:53] 01/09/2009 373424649462 373424649462
1 Nearside front tyre has a tear, caused by separation or partial failure of its structure (4.1.d.1b) Nearside front tyre has a tear, caused by separation or partial failure of its structure (4.1.d.1b) 01 September 2009 [10:53] 01/09/2009 373424649462 373424649462
1 Offside front tyre has a tear, caused by separation or partial failure of its structure (4.1.d.1b) Offside front tyre has a tear, caused by separation or partial failure of its structure (4.1.d.1b) 01 September 2009 [10:53] 01/09/2009 373424649462 373424649462
1 Offside front wheel bearing rough when rotated (2.5.a.2) Offside front wheel bearing rough when rotated (2.5.a.2) 01 September 2009 [10:53] 01/09/2009 373424649462 373424649462
1 Nearside front front position lamp(s) not working (1.1.a.3b) Nearside front front position lamp(s) not working (1.1.a.3b) 13 April 2007 [08:51] 13/04/2007 751463507187 751463507187
1 Nearside front headlamp not working on dipped beam (1.7.5a) Nearside front headlamp not working on dipped beam (1.7.5a) 13 April 2007 [08:51] 13/04/2007 751463507187 751463507187
1 Offside front headlamp not working on dipped beam (1.7.5a) Offside front headlamp not working on dipped beam (1.7.5a) 13 April 2007 [08:51] 13/04/2007 751463507187 751463507187
1 Nearside front headlamp not working on main beam (1.7.5a) Nearside front headlamp not working on main beam (1.7.5a) 13 April 2007 [08:51] 13/04/2007 751463507187 751463507187
1 Offside front headlamp not working on main beam (1.7.5a) Offside front headlamp not working on main beam (1.7.5a) 13 April 2007 [08:51] 13/04/2007 751463507187 751463507187
1 Rear exhaust mounting missing (7.1.1b) Rear exhaust mounting missing (7.1.1b) 13 April 2007 [08:51] 13/04/2007 751463507187 751463507187
1 Centre brake pipe inadequately clipped (3.6.b.1) Centre brake pipe inadequately clipped (3.6.b.1) 13 April 2007 [08:51] 13/04/2007 751463507187 751463507187
1 Nearside rear rear brake binding (3.7.b.1) Nearside rear rear brake binding (3.7.b.1) 13 April 2007 [08:51] 13/04/2007 751463507187 751463507187

ALL 569 UXY User Entered Faults [2]

ALL User Entered faults, ORDERED by OCCURRENCE DURING 569 UXY's MOT HISTORY
ALL 569 UXY User Entered Faults [2]
ALL User Entered faults, ORDERED by OCCURRENCE DURING 569 UXY's MOT HISTORY
User Entered Faults | source www.vehiclestats.co.uk
Fault Fault Test Date Test Date/Time Reference MOT Test Reference
1 Slight play near side front inner tie rod bar Slight play near side front inner tie rod bar 01 June 2011 [16:14] 01/06/2011 396152051130 396152051130
1 1.both rear tyres are cracking badly on outer walls 1.both rear tyres are cracking badly on outer walls 01 September 2009 [10:53] 01/09/2009 373424649462 373424649462

MOT TEST: 23 February 2012 08:13:21 PASSED
MOT TEST: 23 February 2012 08:13:21 PASSED

This test (705994952053) was completed on the 23 February 2012 08:13:21 and PASSED the requirements for a valid MOT with 1 comments.

This test (705994952053) was completed on the 23 February 2012 08:13:21 and PASSED the requirements for a valid MOT with 1 comments.

Recorded mileage: 66,796

Recorded mileage: 66,796


ADVISORY


MOT TEST: 22 February 2012 15:55:52 FAILED
MOT TEST: 22 February 2012 15:55:52 FAILED

This test (736563152091) was completed on the 22 February 2012 15:55:52 and FAILED the requirements for a valid MOT with 5 comments.

This test (736563152091) was completed on the 22 February 2012 15:55:52 and FAILED the requirements for a valid MOT with 5 comments.

Recorded mileage: 66,796

Recorded mileage: 66,796


ADVISORY

FAIL


MOT TEST: 01 June 2011 16:14:17 PASSED
MOT TEST: 01 June 2011 16:14:17 PASSED

This test (396152051130) was completed on the 01 June 2011 16:14:17 and PASSED the requirements for a valid MOT with 1 comments.

This test (396152051130) was completed on the 01 June 2011 16:14:17 and PASSED the requirements for a valid MOT with 1 comments.

Recorded mileage: 66,502

Recorded mileage: 66,502


USER ENTERED


MOT TEST: 02 September 2009 13:13:26 PASSED
MOT TEST: 02 September 2009 13:13:26 PASSED

This test (963525649223) was completed on the 02 September 2009 13:13:26 and PASSED the requirements for a valid MOT with 0 comments.

This test (963525649223) was completed on the 02 September 2009 13:13:26 and PASSED the requirements for a valid MOT with 0 comments.

Recorded mileage: 17,155

Recorded mileage: 17,155


MOT TEST: 01 September 2009 10:53:50 FAILED
MOT TEST: 01 September 2009 10:53:50 FAILED

This test (373424649462) was completed on the 01 September 2009 10:53:50 and FAILED the requirements for a valid MOT with 9 comments.

This test (373424649462) was completed on the 01 September 2009 10:53:50 and FAILED the requirements for a valid MOT with 9 comments.

Recorded mileage: 17,155

Recorded mileage: 17,155


FAIL

USER ENTERED


MOT TEST: 09 April 2008 17:20:45 PASSED
MOT TEST: 09 April 2008 17:20:45 PASSED

This test (892020308181) was completed on the 09 April 2008 17:20:45 and PASSED the requirements for a valid MOT with 0 comments.

This test (892020308181) was completed on the 09 April 2008 17:20:45 and PASSED the requirements for a valid MOT with 0 comments.

Recorded mileage: 17,154

Recorded mileage: 17,154


MOT TEST: 16 April 2007 10:58:03 PASSED
MOT TEST: 16 April 2007 10:58:03 PASSED

This test (961066307156) was completed on the 16 April 2007 10:58:03 and PASSED the requirements for a valid MOT with 0 comments.

This test (961066307156) was completed on the 16 April 2007 10:58:03 and PASSED the requirements for a valid MOT with 0 comments.

Recorded mileage: 17,154

Recorded mileage: 17,154


MOT TEST: 13 April 2007 08:51:00 FAILED
MOT TEST: 13 April 2007 08:51:00 FAILED

This test (751463507187) was completed on the 13 April 2007 08:51:00 and FAILED the requirements for a valid MOT with 8 comments.

This test (751463507187) was completed on the 13 April 2007 08:51:00 and FAILED the requirements for a valid MOT with 8 comments.

Recorded mileage: 17,154

Recorded mileage: 17,154


FAIL