587 YUK


587YUK is registered to a Cream 1961, Morris Minor with a Petrol engine. It Failed its most recent MOT Test on the 23 March 2017

29 unique faults (35 Total) reported in its MOT History (8 Tests).

4 common/recurring faults, the most frequent (4 times) is: Oil leak.

62% (5) MOT Pass Rate and a 38% (3) MOT Failure Rate.

92,022 recorded miles.

587 YUK


587YUK is registered to a Cream 1961, Morris Minor with a Petrol engine. It Failed its most recent MOT Test on the 23 March 2017

29 unique faults (35 Total) reported in its MOT History (8 Tests).

4 common/recurring faults, the most frequent (4 times) is: Oil leak.

62% (5) MOT Pass Rate and a 38% (3) MOT Failure Rate.

92,022 recorded miles.

MOT PASS/Failure rate for 587 YUK

all MOT test results for 587 YUK represented as a percentage
MOT PASS/Failure rate for 587 YUK
all MOT test results for 587 YUK represented as a percentage

PERCENTAGE OF VEHICLE FAULTS WITH 587 YUK

ALL REPORTED FAULTS, DISPLAYED BY PERCENTAGE OF OCCURRENCE DURING ALL MOT TESTS
PERCENTAGE OF VEHICLE FAULTS WITH 587 YUK
ALL REPORTED FAULTS, DISPLAYED BY PERCENTAGE OF OCCURRENCE DURING ALL MOT TESTS
ADVISORY

FAIL

USER ENTERED

587 YUK annual Faults by type

ALL REPORTED FAULTS, DISPLAYED over time and categorised by type
587 YUK annual Faults by type
ALL REPORTED FAULTS, DISPLAYED over time and categorised by type

RECURRING FAULTS WITH 587 YUK

FAULTS THAT HAVE OCCURED MORE THAN ONCE DURING 587 YUK's MOT HISTORY
RECURRING FAULTS WITH 587 YUK
FAULTS THAT HAVE OCCURED MORE THAN ONCE DURING 587 YUK's MOT HISTORY
Fault Fault Test Date Test Date/Time Reference MOT Test Reference
4 Oil leak Oil leak 06 August 2015 [14:08] 06/08/2015 03 August 2015 [14:20] 03/08/2015 31 July 2014 [15:26] 31/07/2014 22 July 2014 [16:12] 22/07/2014 788818315243 788818315243 876055315219 876055315219 298232614223 298232614223 957553004277 957553004277
2 Offside front wheel bearing has slight play (2.5.a.3c) Offside front wheel bearing has slight play (2.5.a.3c) 06 August 2015 [14:08] 06/08/2015 03 August 2015 [14:20] 03/08/2015 788818315243 788818315243 876055315219 876055315219
2 Both front tyres out of shape Both front tyres out of shape 06 August 2015 [14:08] 06/08/2015 03 August 2015 [14:20] 03/08/2015 788818315243 788818315243 876055315219 876055315219
2 Offside rear hub seal leaking Offside rear hub seal leaking 06 August 2015 [14:08] 06/08/2015 03 August 2015 [14:20] 03/08/2015 788818315243 788818315243 876055315219 876055315219

ALL 587 YUK ADVISORIES [8]

ALL ADVISORIES, ORDERED by OCCURRENCE DURING 587 YUK's MOT HISTORY
ALL 587 YUK ADVISORIES [8]
ALL ADVISORIES, ORDERED by OCCURRENCE DURING 587 YUK's MOT HISTORY
Advisory Faults | source www.vehiclestats.co.uk
Fault Fault Test Date Test Date/Time Reference MOT Test Reference
2 Offside front wheel bearing has slight play (2.5.a.3c) Offside front wheel bearing has slight play (2.5.a.3c) 06 August 2015 [14:08] 06/08/2015 03 August 2015 [14:20] 03/08/2015 788818315243 788818315243 876055315219 876055315219
1 Parking brake efficiency only just met Parking brake efficiency only just met 23 March 2017 [08:57] 23/03/2017 213695330613 213695330613
1 Nearside front tyre worn close to the legal limit advise replacement (4.1.e.1) Nearside front tyre worn close to the legal limit advise replacement (4.1.e.1) 23 March 2017 [08:57] 23/03/2017 213695330613 213695330613
1 Both front tyres wearing inner edges Both front tyres wearing inner edges 23 March 2017 [08:57] 23/03/2017 213695330613 213695330613
1 Nearside steering pivot point has slight play lower trunion (2.2.b.1g) Nearside steering pivot point has slight play lower trunion (2.2.b.1g) 23 March 2017 [08:57] 23/03/2017 213695330613 213695330613
1 Underside of vehicle going rusty Underside of vehicle going rusty 23 March 2017 [08:57] 23/03/2017 213695330613 213695330613
1 Parking brake: parking brake efficiency only just met. It would appear that the braking system requires adjustment or repair. (3.7.c.1b) Parking brake: parking brake efficiency only just met. It would appear that the braking system requires adjustment or repair. (3.7.c.1b) 22 July 2014 [16:12] 22/07/2014 957553004277 957553004277

ALL 587 YUK Failure Faults [18]

ALL Failure faults, ORDERED by OCCURRENCE DURING 587 YUK's MOT HISTORY
ALL 587 YUK Failure Faults [18]
ALL Failure faults, ORDERED by OCCURRENCE DURING 587 YUK's MOT HISTORY
Fail Faults | source www.vehiclestats.co.uk
Fault Fault Test Date Test Date/Time Reference MOT Test Reference
1 Parking brake: efficiency below requirements (3.7.c.1b) Parking brake: efficiency below requirements (3.7.c.1b) 03 August 2015 [14:20] 03/08/2015 876055315219 876055315219
1 Offside stop lamp adversely affected by the operation of another lamp (1.2.1f) Offside stop lamp adversely affected by the operation of another lamp (1.2.1f) 22 July 2014 [16:12] 22/07/2014 957553004277 957553004277
1 Fuel system component leaking (7.2.3) Fuel system component leaking (7.2.3) 22 July 2014 [16:12] 22/07/2014 957553004277 957553004277
1 Nearside front tyre has a cut in excess of the requirements deep enough to reach the ply or cords (4.1.d.1a) Nearside front tyre has a cut in excess of the requirements deep enough to reach the ply or cords (4.1.d.1a) 22 July 2014 [16:12] 22/07/2014 957553004277 957553004277
1 Offside front tyre has a cut in excess of the requirements deep enough to reach the ply or cords (4.1.d.1a) Offside front tyre has a cut in excess of the requirements deep enough to reach the ply or cords (4.1.d.1a) 22 July 2014 [16:12] 22/07/2014 957553004277 957553004277
1 Nearside front tyre tread depth below requirements of 1.6mm (4.1.e.1) Nearside front tyre tread depth below requirements of 1.6mm (4.1.e.1) 22 July 2014 [16:12] 22/07/2014 957553004277 957553004277
1 Offside front tyre tread depth below requirements of 1.6mm (4.1.e.1) Offside front tyre tread depth below requirements of 1.6mm (4.1.e.1) 22 July 2014 [16:12] 22/07/2014 957553004277 957553004277
1 Offside rear shock absorber has a serious fluid leak (2.7.3) Offside rear shock absorber has a serious fluid leak (2.7.3) 04 July 2013 [10:47] 04/07/2013 229895683475 229895683475
1 Nearside front body or chassis has an inadequate repair, seriously affecting its strength within 30cm of the body mountings (6.1.b.2) Nearside front body or chassis has an inadequate repair, seriously affecting its strength within 30cm of the body mountings (6.1.b.2) 04 July 2013 [10:47] 04/07/2013 229895683475 229895683475
1 Offside front body or chassis has an inadequate repair, seriously affecting its strength within 30cm of the body mountings (6.1.b.2) Offside front body or chassis has an inadequate repair, seriously affecting its strength within 30cm of the body mountings (6.1.b.2) 04 July 2013 [10:47] 04/07/2013 229895683475 229895683475
1 Nearside rear body or chassis has an inadequate repair, seriously affecting its strength within 30cm of the body mountings (6.1.b.2) Nearside rear body or chassis has an inadequate repair, seriously affecting its strength within 30cm of the body mountings (6.1.b.2) 04 July 2013 [10:47] 04/07/2013 229895683475 229895683475
1 Offside rear body or chassis has excessive corrosion, seriously affecting its strength within 30cm of the body mountings (6.1.b.2) Offside rear body or chassis has excessive corrosion, seriously affecting its strength within 30cm of the body mountings (6.1.b.2) 04 July 2013 [10:47] 04/07/2013 229895683475 229895683475
1 Brake pipe inadequately clipped (3.6.b.1) Brake pipe inadequately clipped (3.6.b.1) 04 July 2013 [10:47] 04/07/2013 229895683475 229895683475
1 Fuel pipe leaking (7.2.3) Fuel pipe leaking (7.2.3) 04 July 2013 [10:47] 04/07/2013 229895683475 229895683475
1 Nearside front tyre has a lump, caused by separation or partial failure of its structure (4.1.d.1b) Nearside front tyre has a lump, caused by separation or partial failure of its structure (4.1.d.1b) 04 July 2013 [10:47] 04/07/2013 229895683475 229895683475
1 Service brake: efficiency below requirements (3.7.b.7) Service brake: efficiency below requirements (3.7.b.7) 04 July 2013 [10:47] 04/07/2013 229895683475 229895683475
1 Parking brake: efficiency below requirements (3.7.b.7) Parking brake: efficiency below requirements (3.7.b.7) 04 July 2013 [10:47] 04/07/2013 229895683475 229895683475
1 Brakes imbalanced across an axle (3.7.b.5b) Brakes imbalanced across an axle (3.7.b.5b) 04 July 2013 [10:47] 04/07/2013 229895683475 229895683475

ALL 587 YUK User Entered Faults [9]

ALL User Entered faults, ORDERED by OCCURRENCE DURING 587 YUK's MOT HISTORY
ALL 587 YUK User Entered Faults [9]
ALL User Entered faults, ORDERED by OCCURRENCE DURING 587 YUK's MOT HISTORY
Advisory Faults | source www.vehiclestats.co.uk
Fault Fault Test Date Test Date/Time Reference MOT Test Reference
4 Oil leak Oil leak 06 August 2015 [14:08] 06/08/2015 03 August 2015 [14:20] 03/08/2015 31 July 2014 [15:26] 31/07/2014 22 July 2014 [16:12] 22/07/2014 788818315243 788818315243 876055315219 876055315219 298232614223 298232614223 957553004277 957553004277
2 Both front tyres out of shape Both front tyres out of shape 06 August 2015 [14:08] 06/08/2015 03 August 2015 [14:20] 03/08/2015 788818315243 788818315243 876055315219 876055315219
2 Offside rear hub seal leaking Offside rear hub seal leaking 06 August 2015 [14:08] 06/08/2015 03 August 2015 [14:20] 03/08/2015 788818315243 788818315243 876055315219 876055315219
1 Rear axle halfshafts leaking Rear axle halfshafts leaking 22 July 2014 [16:12] 22/07/2014 957553004277 957553004277

MOT TEST: 23 March 2017 08:57:09 PASSED
MOT TEST: 23 March 2017 08:57:09 PASSED

This test (213695330613) was completed on the 23 March 2017 08:57:09 and PASSED the requirements for a valid MOT with 5 comments.

This test (213695330613) was completed on the 23 March 2017 08:57:09 and PASSED the requirements for a valid MOT with 5 comments.

Recorded mileage: 92,022

Recorded mileage: 92,022


ADVISORY


MOT TEST: 06 August 2015 14:08:08 PASSED
MOT TEST: 06 August 2015 14:08:08 PASSED

This test (788818315243) was completed on the 06 August 2015 14:08:08 and PASSED the requirements for a valid MOT with 4 comments.

This test (788818315243) was completed on the 06 August 2015 14:08:08 and PASSED the requirements for a valid MOT with 4 comments.

Recorded mileage: 90,457

Recorded mileage: 90,457


ADVISORY

USER ENTERED


MOT TEST: 03 August 2015 14:20:36 FAILED
MOT TEST: 03 August 2015 14:20:36 FAILED

This test (876055315219) was completed on the 03 August 2015 14:20:36 and FAILED the requirements for a valid MOT with 5 comments.

This test (876055315219) was completed on the 03 August 2015 14:20:36 and FAILED the requirements for a valid MOT with 5 comments.

Recorded mileage: 90,450

Recorded mileage: 90,450


ADVISORY

FAIL

USER ENTERED


MOT TEST: 31 July 2014 15:26:37 PASSED
MOT TEST: 31 July 2014 15:26:37 PASSED

This test (298232614223) was completed on the 31 July 2014 15:26:37 and PASSED the requirements for a valid MOT with 1 comments.

This test (298232614223) was completed on the 31 July 2014 15:26:37 and PASSED the requirements for a valid MOT with 1 comments.

Recorded mileage: 88,139

Recorded mileage: 88,139


USER ENTERED


MOT TEST: 22 July 2014 16:12:16 FAILED
MOT TEST: 22 July 2014 16:12:16 FAILED

This test (957553004277) was completed on the 22 July 2014 16:12:16 and FAILED the requirements for a valid MOT with 9 comments.

This test (957553004277) was completed on the 22 July 2014 16:12:16 and FAILED the requirements for a valid MOT with 9 comments.

Recorded mileage: 88,135

Recorded mileage: 88,135


ADVISORY

FAIL

USER ENTERED


MOT TEST: 11 July 2013 14:45:23 PASSED
MOT TEST: 11 July 2013 14:45:23 PASSED

This test (836472893150) was completed on the 11 July 2013 14:45:23 and PASSED the requirements for a valid MOT with 0 comments.

This test (836472893150) was completed on the 11 July 2013 14:45:23 and PASSED the requirements for a valid MOT with 0 comments.

Recorded mileage: 86,628

Recorded mileage: 86,628


MOT TEST: 04 July 2013 10:47:20 FAILED
MOT TEST: 04 July 2013 10:47:20 FAILED

This test (229895683475) was completed on the 04 July 2013 10:47:20 and FAILED the requirements for a valid MOT with 11 comments.

This test (229895683475) was completed on the 04 July 2013 10:47:20 and FAILED the requirements for a valid MOT with 11 comments.

Recorded mileage: 86,602

Recorded mileage: 86,602


FAIL


MOT TEST: 04 April 2012 07:59:08 PASSED
MOT TEST: 04 April 2012 07:59:08 PASSED

This test (127875192422) was completed on the 04 April 2012 07:59:08 and PASSED the requirements for a valid MOT with 0 comments.

This test (127875192422) was completed on the 04 April 2012 07:59:08 and PASSED the requirements for a valid MOT with 0 comments.

Recorded mileage: 85,912

Recorded mileage: 85,912