591 0PF


5910PF is registered to a Blue 1963, Morris Minor 1000 with a Petrol engine. It Passed its most recent MOT Test on the 26 July 2018

45 unique faults (58 Total) reported in its MOT History (9 Tests).

9 common/recurring faults, the most frequent (2 times) is: Indicator tell-tale inoperative (4.9.1 (a) (i)).

44% (4) MOT Pass Rate and a 56% (5) MOT Failure Rate.

25,582 recorded miles.

591 0PF


5910PF is registered to a Blue 1963, Morris Minor 1000 with a Petrol engine. It Passed its most recent MOT Test on the 26 July 2018

45 unique faults (58 Total) reported in its MOT History (9 Tests).

9 common/recurring faults, the most frequent (2 times) is: Indicator tell-tale inoperative (4.9.1 (a) (i)).

44% (4) MOT Pass Rate and a 56% (5) MOT Failure Rate.

25,582 recorded miles.

MOT PASS/Failure rate for 591 0PF

all MOT test results for 591 0PF represented as a percentage
MOT PASS/Failure rate for 591 0PF
all MOT test results for 591 0PF represented as a percentage

PERCENTAGE OF VEHICLE FAULTS WITH 591 0PF

ALL REPORTED FAULTS, DISPLAYED BY PERCENTAGE OF OCCURRENCE DURING ALL MOT TESTS
PERCENTAGE OF VEHICLE FAULTS WITH 591 0PF
ALL REPORTED FAULTS, DISPLAYED BY PERCENTAGE OF OCCURRENCE DURING ALL MOT TESTS
ADVISORY

FAIL

USER ENTERED

MINOR

591 0PF annual Faults by type

ALL REPORTED FAULTS, DISPLAYED over time and categorised by type
591 0PF annual Faults by type
ALL REPORTED FAULTS, DISPLAYED over time and categorised by type

RECURRING FAULTS WITH 591 0PF

FAULTS THAT HAVE OCCURED MORE THAN ONCE DURING 591 0PF's MOT HISTORY
RECURRING FAULTS WITH 591 0PF
FAULTS THAT HAVE OCCURED MORE THAN ONCE DURING 591 0PF's MOT HISTORY
Fault Fault Test Date Test Date/Time Reference MOT Test Reference
2 Indicator tell-tale inoperative (4.9.1 (a) (i)) Indicator tell-tale inoperative (4.9.1 (a) (i)) 26 July 2018 [14:56] 26/07/2018 24 July 2018 [11:26] 24/07/2018 755084951233 755084951233 315736537956 315736537956
2 Slight play in nsf suspension joints Slight play in nsf suspension joints 26 July 2018 [14:56] 26/07/2018 24 July 2018 [11:26] 24/07/2018 755084951233 755084951233 315736537956 315736537956
2 Slight play in nsf top swivel joint / osf bottom swivel joint Slight play in nsf top swivel joint / osf bottom swivel joint 21 July 2017 [14:24] 21/07/2017 07 July 2017 [09:55] 07/07/2017 544476875730 544476875730 445056257873 445056257873
2 Exhaust fouling nsr shock absorber casing Exhaust fouling nsr shock absorber casing 21 July 2017 [14:24] 21/07/2017 07 July 2017 [09:55] 07/07/2017 544476875730 544476875730 445056257873 445056257873
2 No passenger seat fitted at time of test No passenger seat fitted at time of test 27 June 2016 [11:04] 27/06/2016 22 June 2016 [09:13] 22/06/2016 640395001772 640395001772 898689130776 898689130776
2 Offside front wheel bearing has slight play (2.5.a.3c) Offside front wheel bearing has slight play (2.5.a.3c) 27 June 2016 [11:04] 27/06/2016 22 June 2016 [09:13] 22/06/2016 640395001772 640395001772 898689130776 898689130776
2 Nearside front brake hose stretched (found during steering lock to lock check) (2.2.d.2b) Nearside front brake hose stretched (found during steering lock to lock check) (2.2.d.2b) 22 June 2016 [09:13] 22/06/2016 09 May 2008 [09:50] 09/05/2008 898689130776 898689130776 250540238434 250540238434
2 Offside front brake hose stretched (found during steering lock to lock check) (2.2.d.2b) Offside front brake hose stretched (found during steering lock to lock check) (2.2.d.2b) 22 June 2016 [09:13] 22/06/2016 09 May 2008 [09:50] 09/05/2008 898689130776 898689130776 250540238434 250540238434
2 Offside steering rack gaiter split (2.2.d.2d) Offside steering rack gaiter split (2.2.d.2d) 22 June 2016 [09:13] 22/06/2016 09 May 2008 [09:50] 09/05/2008 898689130776 898689130776 250540238434 250540238434

ALL 591 0PF ADVISORIES [11]

ALL ADVISORIES, ORDERED by OCCURRENCE DURING 591 0PF's MOT HISTORY
ALL 591 0PF ADVISORIES [11]
ALL ADVISORIES, ORDERED by OCCURRENCE DURING 591 0PF's MOT HISTORY
Minor Faults | source www.vehiclestats.co.uk
Fault Fault Test Date Test Date/Time Reference MOT Test Reference
2 Slight play in nsf suspension joints Slight play in nsf suspension joints 26 July 2018 [14:56] 26/07/2018 24 July 2018 [11:26] 24/07/2018 755084951233 755084951233 315736537956 315736537956
2 Slight play in nsf top swivel joint / osf bottom swivel joint Slight play in nsf top swivel joint / osf bottom swivel joint 21 July 2017 [14:24] 21/07/2017 07 July 2017 [09:55] 07/07/2017 544476875730 544476875730 445056257873 445056257873
2 Exhaust fouling nsr shock absorber casing Exhaust fouling nsr shock absorber casing 21 July 2017 [14:24] 21/07/2017 07 July 2017 [09:55] 07/07/2017 544476875730 544476875730 445056257873 445056257873
2 No passenger seat fitted at time of test No passenger seat fitted at time of test 27 June 2016 [11:04] 27/06/2016 22 June 2016 [09:13] 22/06/2016 640395001772 640395001772 898689130776 898689130776
2 Offside front wheel bearing has slight play (2.5.a.3c) Offside front wheel bearing has slight play (2.5.a.3c) 27 June 2016 [11:04] 27/06/2016 22 June 2016 [09:13] 22/06/2016 640395001772 640395001772 898689130776 898689130776
1 Front brake disc slightly scored (3.5.1h) Front brake disc slightly scored (3.5.1h) 09 May 2007 [13:31] 09/05/2007 272139427414 272139427414

ALL 591 0PF Failure Faults [41]

ALL Failure faults, ORDERED by OCCURRENCE DURING 591 0PF's MOT HISTORY
ALL 591 0PF Failure Faults [41]
ALL Failure faults, ORDERED by OCCURRENCE DURING 591 0PF's MOT HISTORY
Fail Faults | source www.vehiclestats.co.uk
Fault Fault Test Date Test Date/Time Reference MOT Test Reference
2 Nearside front brake hose stretched (found during steering lock to lock check) (2.2.d.2b) Nearside front brake hose stretched (found during steering lock to lock check) (2.2.d.2b) 22 June 2016 [09:13] 22/06/2016 09 May 2008 [09:50] 09/05/2008 898689130776 898689130776 250540238434 250540238434
2 Offside front brake hose stretched (found during steering lock to lock check) (2.2.d.2b) Offside front brake hose stretched (found during steering lock to lock check) (2.2.d.2b) 22 June 2016 [09:13] 22/06/2016 09 May 2008 [09:50] 09/05/2008 898689130776 898689130776 250540238434 250540238434
2 Offside steering rack gaiter split (2.2.d.2d) Offside steering rack gaiter split (2.2.d.2d) 22 June 2016 [09:13] 22/06/2016 09 May 2008 [09:50] 09/05/2008 898689130776 898689130776 250540238434 250540238434
1 Nearside front headlamp light intensity severely reduced dip (4.1.4 (a)) Nearside front headlamp light intensity severely reduced dip (4.1.4 (a)) 24 July 2018 [11:26] 24/07/2018 315736537956 315736537956
1 Nearside front headlamp light intensity severely reduced main (4.1.4 (a)) Nearside front headlamp light intensity severely reduced main (4.1.4 (a)) 24 July 2018 [11:26] 24/07/2018 315736537956 315736537956
1 Oil leaking excessively from engine rocker gasket ? (8.4.1 (a) (i)) Oil leaking excessively from engine rocker gasket ? (8.4.1 (a) (i)) 24 July 2018 [11:26] 24/07/2018 315736537956 315736537956
1 Direction indicators not working (1.4.a.2c) Direction indicators not working (1.4.a.2c) 07 July 2017 [09:55] 07/07/2017 445056257873 445056257873
1 Nearside front headlamp aim too high (1.8) Nearside front headlamp aim too high (1.8) 07 July 2017 [09:55] 07/07/2017 445056257873 445056257873
1 Offside front headlamp aim too low (1.8) Offside front headlamp aim too low (1.8) 07 July 2017 [09:55] 07/07/2017 445056257873 445056257873
1 Service brake: efficiency below requirements (3.7.b.7) Service brake: efficiency below requirements (3.7.b.7) 22 June 2016 [09:13] 22/06/2016 898689130776 898689130776
1 Front brakes imbalanced across an axle (3.7.b.5b) Front brakes imbalanced across an axle (3.7.b.5b) 22 June 2016 [09:13] 22/06/2016 898689130776 898689130776
1 Rear brakes imbalanced across an axle axle 2 (3.7.b.5b) Rear brakes imbalanced across an axle axle 2 (3.7.b.5b) 22 June 2016 [09:13] 22/06/2016 898689130776 898689130776
1 Indicator tell tale inoperative (1.4.a.2a) Indicator tell tale inoperative (1.4.a.2a) 22 June 2016 [09:13] 22/06/2016 898689130776 898689130776
1 Front windscreen wiper does not clear the windscreen effectively (8.2.2) Front windscreen wiper does not clear the windscreen effectively (8.2.2) 22 June 2016 [09:13] 22/06/2016 898689130776 898689130776
1 Nearside headlamp aim too high (1.8) Nearside headlamp aim too high (1.8) 22 June 2016 [09:13] 22/06/2016 898689130776 898689130776
1 Offside headlamp aim too high (1.8) Offside headlamp aim too high (1.8) 22 June 2016 [09:13] 22/06/2016 898689130776 898689130776
1 Offside front front brake recording little or no effort (3.7.b.5a) Offside front front brake recording little or no effort (3.7.b.5a) 22 June 2016 [09:13] 22/06/2016 898689130776 898689130776
1 Rear brakes imbalanced across an axle (3.7.b.5b) Rear brakes imbalanced across an axle (3.7.b.5b) 22 June 2016 [09:13] 22/06/2016 898689130776 898689130776
1 Rear parking brake recording little or no effort (3.7.b.6a) Rear parking brake recording little or no effort (3.7.b.6a) 22 June 2016 [09:13] 22/06/2016 898689130776 898689130776
1 Offside indicator switch faulty (1.4.a.1) Offside indicator switch faulty (1.4.a.1) 09 May 2008 [09:50] 09/05/2008 250540238434 250540238434
1 Offside body or chassis has excessive corrosion, seriously affecting its strength within 30cm of the body mountings (6.1.b.2) Offside body or chassis has excessive corrosion, seriously affecting its strength within 30cm of the body mountings (6.1.b.2) 09 May 2008 [09:50] 09/05/2008 250540238434 250540238434
1 Nearside rear body or chassis has excessive corrosion, seriously affecting its strength within 30cm of the body mountings (6.1.b.2) Nearside rear body or chassis has excessive corrosion, seriously affecting its strength within 30cm of the body mountings (6.1.b.2) 09 May 2008 [09:50] 09/05/2008 250540238434 250540238434
1 Offside rear body or chassis has excessive corrosion, seriously affecting its strength within 30cm of the body mountings (6.1.b.2) Offside rear body or chassis has excessive corrosion, seriously affecting its strength within 30cm of the body mountings (6.1.b.2) 09 May 2008 [09:50] 09/05/2008 250540238434 250540238434
1 Front headlamp aim too high (1.8) Front headlamp aim too high (1.8) 09 May 2008 [09:50] 09/05/2008 250540238434 250540238434
1 Offside windscreen washer provides insufficient washer liquid (8.2.3) Offside windscreen washer provides insufficient washer liquid (8.2.3) 09 May 2008 [09:50] 09/05/2008 250540238434 250540238434
1 Brake hydraulic reservoir fluid level below minimum level (3.6.g.1b) Brake hydraulic reservoir fluid level below minimum level (3.6.g.1b) 09 May 2008 [09:50] 09/05/2008 250540238434 250540238434
1 Drivers seat insecure (6.2.a.1) Drivers seat insecure (6.2.a.1) 09 May 2008 [09:50] 09/05/2008 250540238434 250540238434
1 Brakes imbalanced across an axle (3.7.b.5b) Brakes imbalanced across an axle (3.7.b.5b) 09 May 2008 [09:50] 09/05/2008 250540238434 250540238434
1 Front windscreen wiper not operating automatically when switched on (8.2.1b) Front windscreen wiper not operating automatically when switched on (8.2.1b) 09 May 2007 [13:31] 09/05/2007 272139427414 272139427414
1 Front windscreen washer provides insufficient washer liquid (8.2.3) Front windscreen washer provides insufficient washer liquid (8.2.3) 09 May 2007 [13:31] 09/05/2007 272139427414 272139427414
1 Nearside front tyre has a lump, caused by separation or partial failure of its structure (4.1.d.1b) Nearside front tyre has a lump, caused by separation or partial failure of its structure (4.1.d.1b) 09 May 2007 [13:31] 09/05/2007 272139427414 272139427414
1 Offside front tyre has a bulge, caused by separation or partial failure of its structure (4.1.d.1b) Offside front tyre has a bulge, caused by separation or partial failure of its structure (4.1.d.1b) 09 May 2007 [13:31] 09/05/2007 272139427414 272139427414
1 Nearside rear tyre has a lump, caused by separation or partial failure of its structure (4.1.d.1b) Nearside rear tyre has a lump, caused by separation or partial failure of its structure (4.1.d.1b) 09 May 2007 [13:31] 09/05/2007 272139427414 272139427414
1 Offside rear tyre has a tear, caused by separation or partial failure of its structure (4.1.d.1b) Offside rear tyre has a tear, caused by separation or partial failure of its structure (4.1.d.1b) 09 May 2007 [13:31] 09/05/2007 272139427414 272139427414

ALL 591 0PF minor Faults [2]

ALL minor faults, ORDERED by OCCURRENCE DURING 591 0PF's MOT HISTORY
ALL 591 0PF minor Faults [2]
ALL minor faults, ORDERED by OCCURRENCE DURING 591 0PF's MOT HISTORY
Minor Faults | source www.vehiclestats.co.uk
Fault Fault Test Date Test Date/Time Reference MOT Test Reference
2 Indicator tell-tale inoperative (4.9.1 (a) (i)) Indicator tell-tale inoperative (4.9.1 (a) (i)) 26 July 2018 [14:56] 26/07/2018 24 July 2018 [11:26] 24/07/2018 755084951233 755084951233 315736537956 315736537956

ALL 591 0PF User Entered Faults [4]

ALL User Entered faults, ORDERED by OCCURRENCE DURING 591 0PF's MOT HISTORY
ALL 591 0PF User Entered Faults [4]
ALL User Entered faults, ORDERED by OCCURRENCE DURING 591 0PF's MOT HISTORY
Fail Faults | source www.vehiclestats.co.uk
Fault Fault Test Date Test Date/Time Reference MOT Test Reference
1 O/s/r and o/s/f bump stops missing O/s/r and o/s/f bump stops missing 09 May 2008 [09:50] 09/05/2008 250540238434 250540238434
1 General corrosion to floor General corrosion to floor 09 May 2008 [09:50] 09/05/2008 250540238434 250540238434
1 Starter motor in/op Starter motor in/op 09 May 2007 [13:31] 09/05/2007 272139427414 272139427414
1 Slight play in front wheel bearings Slight play in front wheel bearings 09 May 2007 [13:31] 09/05/2007 272139427414 272139427414

MOT TEST: 26 July 2018 14:56:59 PASSED
MOT TEST: 26 July 2018 14:56:59 PASSED

This test (755084951233) was completed on the 26 July 2018 14:56:59 and PASSED the requirements for a valid MOT with 2 comments.

This test (755084951233) was completed on the 26 July 2018 14:56:59 and PASSED the requirements for a valid MOT with 2 comments.

Recorded mileage: 25,582

Recorded mileage: 25,582


ADVISORY

MINOR


MOT TEST: 24 July 2018 11:26:07 FAILED
MOT TEST: 24 July 2018 11:26:07 FAILED

This test (315736537956) was completed on the 24 July 2018 11:26:07 and FAILED the requirements for a valid MOT with 5 comments.

This test (315736537956) was completed on the 24 July 2018 11:26:07 and FAILED the requirements for a valid MOT with 5 comments.

Recorded mileage: 25,582

Recorded mileage: 25,582


ADVISORY

FAIL

MINOR


MOT TEST: 21 July 2017 14:24:38 PASSED
MOT TEST: 21 July 2017 14:24:38 PASSED

This test (544476875730) was completed on the 21 July 2017 14:24:38 and PASSED the requirements for a valid MOT with 2 comments.

This test (544476875730) was completed on the 21 July 2017 14:24:38 and PASSED the requirements for a valid MOT with 2 comments.

Recorded mileage: 25,582

Recorded mileage: 25,582


ADVISORY


MOT TEST: 07 July 2017 09:55:18 FAILED
MOT TEST: 07 July 2017 09:55:18 FAILED

This test (445056257873) was completed on the 07 July 2017 09:55:18 and FAILED the requirements for a valid MOT with 5 comments.

This test (445056257873) was completed on the 07 July 2017 09:55:18 and FAILED the requirements for a valid MOT with 5 comments.

Recorded mileage: 25,582

Recorded mileage: 25,582


ADVISORY

FAIL


MOT TEST: 27 June 2016 11:04:17 PASSED
MOT TEST: 27 June 2016 11:04:17 PASSED

This test (640395001772) was completed on the 27 June 2016 11:04:17 and PASSED the requirements for a valid MOT with 2 comments.

This test (640395001772) was completed on the 27 June 2016 11:04:17 and PASSED the requirements for a valid MOT with 2 comments.

Recorded mileage: 25,582

Recorded mileage: 25,582


ADVISORY


MOT TEST: 22 June 2016 09:13:08 FAILED
MOT TEST: 22 June 2016 09:13:08 FAILED

This test (898689130776) was completed on the 22 June 2016 09:13:08 and FAILED the requirements for a valid MOT with 17 comments.

This test (898689130776) was completed on the 22 June 2016 09:13:08 and FAILED the requirements for a valid MOT with 17 comments.

Recorded mileage: 25,582

Recorded mileage: 25,582


ADVISORY

FAIL


MOT TEST: 09 May 2008 09:50:27 FAILED
MOT TEST: 09 May 2008 09:50:27 FAILED

This test (250540238434) was completed on the 09 May 2008 09:50:27 and FAILED the requirements for a valid MOT with 16 comments.

This test (250540238434) was completed on the 09 May 2008 09:50:27 and FAILED the requirements for a valid MOT with 16 comments.

Recorded mileage: 25,349

Recorded mileage: 25,349


FAIL

USER ENTERED


MOT TEST: 18 May 2007 08:50:20 PASSED
MOT TEST: 18 May 2007 08:50:20 PASSED

This test (330128737132) was completed on the 18 May 2007 08:50:20 and PASSED the requirements for a valid MOT with 0 comments.

This test (330128737132) was completed on the 18 May 2007 08:50:20 and PASSED the requirements for a valid MOT with 0 comments.

Recorded mileage: 25,146

Recorded mileage: 25,146


MOT TEST: 09 May 2007 13:31:07 FAILED
MOT TEST: 09 May 2007 13:31:07 FAILED

This test (272139427414) was completed on the 09 May 2007 13:31:07 and FAILED the requirements for a valid MOT with 9 comments.

This test (272139427414) was completed on the 09 May 2007 13:31:07 and FAILED the requirements for a valid MOT with 9 comments.

Recorded mileage: 25,146

Recorded mileage: 25,146


ADVISORY

FAIL

USER ENTERED