591 THT


591THT is registered to a Grey 1963, Morris Minor 1000 with a Petrol engine. It Passed its most recent MOT Test on the 26 October 2018

24 unique faults (27 Total) reported in its MOT History (14 Tests).

2 common/recurring faults, the most frequent (2 times) is: Body has slight corrosion Under (6.1.B.2).

71% (10) MOT Pass Rate and a 29% (4) MOT Failure Rate.

91,999 recorded miles.

591 THT


591THT is registered to a Grey 1963, Morris Minor 1000 with a Petrol engine. It Passed its most recent MOT Test on the 26 October 2018

24 unique faults (27 Total) reported in its MOT History (14 Tests).

2 common/recurring faults, the most frequent (2 times) is: Body has slight corrosion Under (6.1.B.2).

71% (10) MOT Pass Rate and a 29% (4) MOT Failure Rate.

91,999 recorded miles.

MOT PASS/Failure rate for 591 THT

all MOT test results for 591 THT represented as a percentage
MOT PASS/Failure rate for 591 THT
all MOT test results for 591 THT represented as a percentage

PERCENTAGE OF VEHICLE FAULTS WITH 591 THT

ALL REPORTED FAULTS, DISPLAYED BY PERCENTAGE OF OCCURRENCE DURING ALL MOT TESTS
PERCENTAGE OF VEHICLE FAULTS WITH 591 THT
ALL REPORTED FAULTS, DISPLAYED BY PERCENTAGE OF OCCURRENCE DURING ALL MOT TESTS
ADVISORY

FAIL

USER ENTERED

PASS WITH RECTIFICATION

591 THT annual Faults by type

ALL REPORTED FAULTS, DISPLAYED over time and categorised by type
591 THT annual Faults by type
ALL REPORTED FAULTS, DISPLAYED over time and categorised by type

RECURRING FAULTS WITH 591 THT

FAULTS THAT HAVE OCCURED MORE THAN ONCE DURING 591 THT's MOT HISTORY
RECURRING FAULTS WITH 591 THT
FAULTS THAT HAVE OCCURED MORE THAN ONCE DURING 591 THT's MOT HISTORY
Fault Fault Test Date Test Date/Time Reference MOT Test Reference
2 Body has slight corrosion under (6.1.b.2) Body has slight corrosion under (6.1.b.2) 25 September 2017 [11:28] 25/09/2017 25 September 2017 [11:28] 25/09/2017 631535840702 631535840702 984488065956 984488065956
2 Nearside headlamp not in good working order adversely affecting beam image (1.2.4a) Nearside headlamp not in good working order adversely affecting beam image (1.2.4a) 24 July 2008 [12:53] 24/07/2008 28 June 2006 [11:54] 28/06/2006 372056808203 372056808203 231439576442 231439576442

ALL 591 THT ADVISORIES [8]

ALL ADVISORIES, ORDERED by OCCURRENCE DURING 591 THT's MOT HISTORY
ALL 591 THT ADVISORIES [8]
ALL ADVISORIES, ORDERED by OCCURRENCE DURING 591 THT's MOT HISTORY
Advisory Faults | source www.vehiclestats.co.uk
Fault Fault Test Date Test Date/Time Reference MOT Test Reference
2 Body has slight corrosion under (6.1.b.2) Body has slight corrosion under (6.1.b.2) 25 September 2017 [11:28] 25/09/2017 25 September 2017 [11:28] 25/09/2017 631535840702 631535840702 984488065956 984488065956
1 Floor pans slight corrosion Floor pans slight corrosion 26 October 2018 [12:09] 26/10/2018 756332733227 756332733227
1 Nearside front brake pipe corroded, covered in grease or other material (1.1.11 (c)) Nearside front brake pipe corroded, covered in grease or other material (1.1.11 (c)) 26 October 2018 [12:09] 26/10/2018 756332733227 756332733227
1 Offside front brake pipe corroded, covered in grease or other material (1.1.11 (c)) Offside front brake pipe corroded, covered in grease or other material (1.1.11 (c)) 26 October 2018 [12:09] 26/10/2018 756332733227 756332733227
1 Rear brake pipe corroded, covered in grease or other material (1.1.11 (c)) Rear brake pipe corroded, covered in grease or other material (1.1.11 (c)) 26 October 2018 [12:09] 26/10/2018 756332733227 756332733227
1 Nearside front wheel bearing has slight play (2.5.a.3c) Nearside front wheel bearing has slight play (2.5.a.3c) 24 July 2008 [12:53] 24/07/2008 372056808203 372056808203
1 Offside front wheel bearing has slight play (2.5.a.3c) Offside front wheel bearing has slight play (2.5.a.3c) 24 July 2008 [12:53] 24/07/2008 372056808203 372056808203

ALL 591 THT Failure Faults [17]

ALL Failure faults, ORDERED by OCCURRENCE DURING 591 THT's MOT HISTORY
ALL 591 THT Failure Faults [17]
ALL Failure faults, ORDERED by OCCURRENCE DURING 591 THT's MOT HISTORY
Fail Faults | source www.vehiclestats.co.uk
Fault Fault Test Date Test Date/Time Reference MOT Test Reference
2 Nearside headlamp not in good working order adversely affecting beam image (1.2.4a) Nearside headlamp not in good working order adversely affecting beam image (1.2.4a) 24 July 2008 [12:53] 24/07/2008 28 June 2006 [11:54] 28/06/2006 372056808203 372056808203 231439576442 231439576442
1 Front brake recording little or no effort (3.7.b.5a) Front brake recording little or no effort (3.7.b.5a) 06 October 2014 [12:54] 06/10/2014 147999174227 147999174227
1 Rear brake recording little or no effort (3.7.b.5a) Rear brake recording little or no effort (3.7.b.5a) 06 October 2014 [12:54] 06/10/2014 147999174227 147999174227
1 Service brake: efficiency below requirements (3.7.b.7) Service brake: efficiency below requirements (3.7.b.7) 06 October 2014 [12:54] 06/10/2014 147999174227 147999174227
1 Rear stop lamp not working (1.2.1b) Rear stop lamp not working (1.2.1b) 06 October 2014 [12:54] 06/10/2014 147999174227 147999174227
1 Windscreen washer provides insufficient washer liquid (8.2.3) Windscreen washer provides insufficient washer liquid (8.2.3) 24 July 2008 [12:53] 24/07/2008 372056808203 372056808203
1 Offside registration plate lamp not working (1.1.c.1d) Offside registration plate lamp not working (1.1.c.1d) 24 July 2008 [12:53] 24/07/2008 372056808203 372056808203
1 Fuel cap/sealing device sealing washer missing (7.2.4c) Fuel cap/sealing device sealing washer missing (7.2.4c) 24 July 2008 [12:53] 24/07/2008 372056808203 372056808203
1 Nearside stop lamp not working (1.2.1b) Nearside stop lamp not working (1.2.1b) 24 July 2008 [12:53] 24/07/2008 372056808203 372056808203
1 Offside stop lamp not working (1.2.1b) Offside stop lamp not working (1.2.1b) 24 July 2008 [12:53] 24/07/2008 372056808203 372056808203
1 Nearside steering system has a road wheel fouling a part of the vehicle (2.2.d.2a) Nearside steering system has a road wheel fouling a part of the vehicle (2.2.d.2a) 24 July 2008 [12:53] 24/07/2008 372056808203 372056808203
1 Nearside rear suspension spring mounting prescribed area is excessively corroded (2.4.a.3) Nearside rear suspension spring mounting prescribed area is excessively corroded (2.4.a.3) 24 July 2008 [12:53] 24/07/2008 372056808203 372056808203
1 Nearside steering rack gaiter split (2.2.d.2d) Nearside steering rack gaiter split (2.2.d.2d) 24 July 2008 [12:53] 24/07/2008 372056808203 372056808203
1 Parking brake: efficiency below requirements (3.7.d.4) Parking brake: efficiency below requirements (3.7.d.4) 24 July 2008 [12:53] 24/07/2008 372056808203 372056808203
1 Nearside front tyre fouling a part of the vehicle (4.1.d.2) Nearside front tyre fouling a part of the vehicle (4.1.d.2) 28 June 2006 [11:54] 28/06/2006 231439576442 231439576442

ALL 591 THT User Entered Faults [1]

ALL User Entered faults, ORDERED by OCCURRENCE DURING 591 THT's MOT HISTORY
ALL 591 THT User Entered Faults [1]
ALL User Entered faults, ORDERED by OCCURRENCE DURING 591 THT's MOT HISTORY
Fail Faults | source www.vehiclestats.co.uk
Fault Fault Test Date Test Date/Time Reference MOT Test Reference
1 Some small amount of noise from o/s wheel bearing Some small amount of noise from o/s wheel bearing 28 June 2006 [11:54] 28/06/2006 231439576442 231439576442

ALL 591 THT Pass With Rectification Faults [1]

ALL Pass With Rectification faults, ORDERED by OCCURRENCE DURING 591 THT's MOT HISTORY
ALL 591 THT Pass With Rectification Faults [1]
ALL Pass With Rectification faults, ORDERED by OCCURRENCE DURING 591 THT's MOT HISTORY
Pass With Rectification Faults | source www.vehiclestats.co.uk
Fault Fault Test Date Test Date/Time Reference MOT Test Reference
1 Nearside front steering rack gaiter split (2.2.d.2d) Nearside front steering rack gaiter split (2.2.d.2d) 25 September 2017 [11:28] 25/09/2017 984488065956 984488065956

MOT TEST: 26 October 2018 12:09:18 PASSED
MOT TEST: 26 October 2018 12:09:18 PASSED

This test (756332733227) was completed on the 26 October 2018 12:09:18 and PASSED the requirements for a valid MOT with 4 comments.

This test (756332733227) was completed on the 26 October 2018 12:09:18 and PASSED the requirements for a valid MOT with 4 comments.

Recorded mileage: 91,999

Recorded mileage: 91,999


ADVISORY


MOT TEST: 25 September 2017 11:28:37 PASSED
MOT TEST: 25 September 2017 11:28:37 PASSED

This test (631535840702) was completed on the 25 September 2017 11:28:37 and PASSED the requirements for a valid MOT with 1 comments.

This test (631535840702) was completed on the 25 September 2017 11:28:37 and PASSED the requirements for a valid MOT with 1 comments.

Recorded mileage: 90,609

Recorded mileage: 90,609


ADVISORY


MOT TEST: 25 September 2017 11:28:36 FAILED
MOT TEST: 25 September 2017 11:28:36 FAILED

This test (984488065956) was completed on the 25 September 2017 11:28:36 and FAILED the requirements for a valid MOT with 2 comments.

This test (984488065956) was completed on the 25 September 2017 11:28:36 and FAILED the requirements for a valid MOT with 2 comments.

Recorded mileage: 90,609

Recorded mileage: 90,609


ADVISORY

PASS WITH RECTIFICATION


MOT TEST: 28 September 2016 13:11:01 PASSED
MOT TEST: 28 September 2016 13:11:01 PASSED

This test (853787143961) was completed on the 28 September 2016 13:11:01 and PASSED the requirements for a valid MOT with 0 comments.

This test (853787143961) was completed on the 28 September 2016 13:11:01 and PASSED the requirements for a valid MOT with 0 comments.

Recorded mileage: 86,403

Recorded mileage: 86,403


MOT TEST: 13 October 2015 12:29:48 PASSED
MOT TEST: 13 October 2015 12:29:48 PASSED

This test (716550549338) was completed on the 13 October 2015 12:29:48 and PASSED the requirements for a valid MOT with 0 comments.

This test (716550549338) was completed on the 13 October 2015 12:29:48 and PASSED the requirements for a valid MOT with 0 comments.

Recorded mileage: 82,600

Recorded mileage: 82,600


MOT TEST: 07 October 2014 09:45:59 PASSED
MOT TEST: 07 October 2014 09:45:59 PASSED

This test (349510584210) was completed on the 07 October 2014 09:45:59 and PASSED the requirements for a valid MOT with 0 comments.

This test (349510584210) was completed on the 07 October 2014 09:45:59 and PASSED the requirements for a valid MOT with 0 comments.

Recorded mileage: 81,724

Recorded mileage: 81,724


MOT TEST: 06 October 2014 12:54:06 FAILED
MOT TEST: 06 October 2014 12:54:06 FAILED

This test (147999174227) was completed on the 06 October 2014 12:54:06 and FAILED the requirements for a valid MOT with 4 comments.

This test (147999174227) was completed on the 06 October 2014 12:54:06 and FAILED the requirements for a valid MOT with 4 comments.

Recorded mileage: 81,724

Recorded mileage: 81,724


FAIL


MOT TEST: 10 July 2013 14:36:14 PASSED
MOT TEST: 10 July 2013 14:36:14 PASSED

This test (648851193124) was completed on the 10 July 2013 14:36:14 and PASSED the requirements for a valid MOT with 0 comments.

This test (648851193124) was completed on the 10 July 2013 14:36:14 and PASSED the requirements for a valid MOT with 0 comments.

Recorded mileage: 78,848

Recorded mileage: 78,848


MOT TEST: 07 September 2009 08:27:10 PASSED
MOT TEST: 07 September 2009 08:27:10 PASSED

This test (123000659235) was completed on the 07 September 2009 08:27:10 and PASSED the requirements for a valid MOT with 0 comments.

This test (123000659235) was completed on the 07 September 2009 08:27:10 and PASSED the requirements for a valid MOT with 0 comments.

Recorded mileage: 78,769

Recorded mileage: 78,769


MOT TEST: 28 July 2008 14:30:53 PASSED
MOT TEST: 28 July 2008 14:30:53 PASSED

This test (931830418230) was completed on the 28 July 2008 14:30:53 and PASSED the requirements for a valid MOT with 0 comments.

This test (931830418230) was completed on the 28 July 2008 14:30:53 and PASSED the requirements for a valid MOT with 0 comments.

Recorded mileage: 78,694

Recorded mileage: 78,694


MOT TEST: 24 July 2008 12:53:47 FAILED
MOT TEST: 24 July 2008 12:53:47 FAILED

This test (372056808203) was completed on the 24 July 2008 12:53:47 and FAILED the requirements for a valid MOT with 13 comments.

This test (372056808203) was completed on the 24 July 2008 12:53:47 and FAILED the requirements for a valid MOT with 13 comments.

Recorded mileage: 78,692

Recorded mileage: 78,692


ADVISORY

FAIL


MOT TEST: 03 July 2007 15:34:37 PASSED
MOT TEST: 03 July 2007 15:34:37 PASSED

This test (362584187154) was completed on the 03 July 2007 15:34:37 and PASSED the requirements for a valid MOT with 0 comments.

This test (362584187154) was completed on the 03 July 2007 15:34:37 and PASSED the requirements for a valid MOT with 0 comments.

Recorded mileage: 78,025

Recorded mileage: 78,025


MOT TEST: 28 June 2006 16:27:35 PASSED
MOT TEST: 28 June 2006 16:27:35 PASSED

This test (542529476130) was completed on the 28 June 2006 16:27:35 and PASSED the requirements for a valid MOT with 0 comments.

This test (542529476130) was completed on the 28 June 2006 16:27:35 and PASSED the requirements for a valid MOT with 0 comments.

Recorded mileage: 76,602

Recorded mileage: 76,602


MOT TEST: 28 June 2006 11:54:08 FAILED
MOT TEST: 28 June 2006 11:54:08 FAILED

This test (231439576442) was completed on the 28 June 2006 11:54:08 and FAILED the requirements for a valid MOT with 3 comments.

This test (231439576442) was completed on the 28 June 2006 11:54:08 and FAILED the requirements for a valid MOT with 3 comments.

Recorded mileage: 76,600

Recorded mileage: 76,600


FAIL

USER ENTERED