593 6DF


5936DF is registered to a Black 1963, Morris 1000 with a Petrol engine. It Failed its most recent MOT Test on the 17 October 2017

7 unique faults (8 Total) reported in its MOT History (9 Tests).

1 common/recurring faults.

78% (7) MOT Pass Rate and a 22% (2) MOT Failure Rate.

38,742 recorded miles.

593 6DF


5936DF is registered to a Black 1963, Morris 1000 with a Petrol engine. It Failed its most recent MOT Test on the 17 October 2017

7 unique faults (8 Total) reported in its MOT History (9 Tests).

1 common/recurring faults.

78% (7) MOT Pass Rate and a 22% (2) MOT Failure Rate.

38,742 recorded miles.

MOT PASS/Failure rate for 593 6DF

all MOT test results for 593 6DF represented as a percentage
MOT PASS/Failure rate for 593 6DF
all MOT test results for 593 6DF represented as a percentage

PERCENTAGE OF VEHICLE FAULTS WITH 593 6DF

ALL REPORTED FAULTS, DISPLAYED BY PERCENTAGE OF OCCURRENCE DURING ALL MOT TESTS
PERCENTAGE OF VEHICLE FAULTS WITH 593 6DF
ALL REPORTED FAULTS, DISPLAYED BY PERCENTAGE OF OCCURRENCE DURING ALL MOT TESTS
ADVISORY

FAIL

USER ENTERED

593 6DF annual Faults by type

ALL REPORTED FAULTS, DISPLAYED over time and categorised by type
593 6DF annual Faults by type
ALL REPORTED FAULTS, DISPLAYED over time and categorised by type

ALL 593 6DF ADVISORIES [3]

ALL ADVISORIES, ORDERED by OCCURRENCE DURING 593 6DF's MOT HISTORY
ALL 593 6DF ADVISORIES [3]
ALL ADVISORIES, ORDERED by OCCURRENCE DURING 593 6DF's MOT HISTORY
Fail Faults | source www.vehiclestats.co.uk
Fault Fault Test Date Test Date/Time Reference MOT Test Reference
2 Parking brake lever has little reserve travel (3.1.6b) Parking brake lever has little reserve travel (3.1.6b) 11 April 2017 [13:07] 11/04/2017 22 February 2016 [12:29] 22/02/2016 121231288053 121231288053 155025894517 155025894517
1 Offside front lower vehicle structure has slight corrosion cross member (6.1.b.2) Offside front lower vehicle structure has slight corrosion cross member (6.1.b.2) 22 February 2016 [12:29] 22/02/2016 155025894517 155025894517

ALL 593 6DF Failure Faults [4]

ALL Failure faults, ORDERED by OCCURRENCE DURING 593 6DF's MOT HISTORY
ALL 593 6DF Failure Faults [4]
ALL Failure faults, ORDERED by OCCURRENCE DURING 593 6DF's MOT HISTORY
Fail Faults | source www.vehiclestats.co.uk
Fault Fault Test Date Test Date/Time Reference MOT Test Reference
1 Offside front suspension component mounting prescribed area is excessively corroded torsion bar mount to cross menber (2.4.a.3) Offside front suspension component mounting prescribed area is excessively corroded torsion bar mount to cross menber (2.4.a.3) 11 April 2017 [13:07] 11/04/2017 121231288053 121231288053
1 Nearside steering rack gaiter split (2.2.d.2d) Nearside steering rack gaiter split (2.2.d.2d) 26 February 2010 [15:12] 26/02/2010 101357550470 101357550470
1 Offside steering rack gaiter split (2.2.d.2d) Offside steering rack gaiter split (2.2.d.2d) 26 February 2010 [15:12] 26/02/2010 101357550470 101357550470
1 Nearside rear brake recording little or no effort (3.7.b.5a) Nearside rear brake recording little or no effort (3.7.b.5a) 26 February 2010 [15:12] 26/02/2010 101357550470 101357550470

ALL 593 6DF User Entered Faults [1]

ALL User Entered faults, ORDERED by OCCURRENCE DURING 593 6DF's MOT HISTORY
ALL 593 6DF User Entered Faults [1]
ALL User Entered faults, ORDERED by OCCURRENCE DURING 593 6DF's MOT HISTORY
Fail Faults | source www.vehiclestats.co.uk
Fault Fault Test Date Test Date/Time Reference MOT Test Reference
1 Battery insecure Battery insecure 26 February 2010 [15:12] 26/02/2010 101357550470 101357550470

MOT TEST: 17 October 2017 09:33:06 PASSED
MOT TEST: 17 October 2017 09:33:06 PASSED

This test (604261807200) was completed on the 17 October 2017 09:33:06 and PASSED the requirements for a valid MOT with 0 comments.

This test (604261807200) was completed on the 17 October 2017 09:33:06 and PASSED the requirements for a valid MOT with 0 comments.

Recorded mileage: 38,742

Recorded mileage: 38,742


MOT TEST: 11 April 2017 13:07:14 FAILED
MOT TEST: 11 April 2017 13:07:14 FAILED

This test (121231288053) was completed on the 11 April 2017 13:07:14 and FAILED the requirements for a valid MOT with 2 comments.

This test (121231288053) was completed on the 11 April 2017 13:07:14 and FAILED the requirements for a valid MOT with 2 comments.

Recorded mileage: 38,730

Recorded mileage: 38,730


ADVISORY

FAIL


MOT TEST: 22 February 2016 12:29:27 PASSED
MOT TEST: 22 February 2016 12:29:27 PASSED

This test (155025894517) was completed on the 22 February 2016 12:29:27 and PASSED the requirements for a valid MOT with 2 comments.

This test (155025894517) was completed on the 22 February 2016 12:29:27 and PASSED the requirements for a valid MOT with 2 comments.

Recorded mileage: 38,614

Recorded mileage: 38,614


ADVISORY


MOT TEST: 28 March 2014 11:25:25 PASSED
MOT TEST: 28 March 2014 11:25:25 PASSED

This test (705627484092) was completed on the 28 March 2014 11:25:25 and PASSED the requirements for a valid MOT with 0 comments.

This test (705627484092) was completed on the 28 March 2014 11:25:25 and PASSED the requirements for a valid MOT with 0 comments.

Recorded mileage: 36,848

Recorded mileage: 36,848


MOT TEST: 20 March 2012 17:32:02 PASSED
MOT TEST: 20 March 2012 17:32:02 PASSED

This test (266170282093) was completed on the 20 March 2012 17:32:02 and PASSED the requirements for a valid MOT with 0 comments.

This test (266170282093) was completed on the 20 March 2012 17:32:02 and PASSED the requirements for a valid MOT with 0 comments.

Recorded mileage: 34,279

Recorded mileage: 34,279


MOT TEST: 05 March 2010 17:00:53 PASSED
MOT TEST: 05 March 2010 17:00:53 PASSED

This test (154064460062) was completed on the 05 March 2010 17:00:53 and PASSED the requirements for a valid MOT with 0 comments.

This test (154064460062) was completed on the 05 March 2010 17:00:53 and PASSED the requirements for a valid MOT with 0 comments.

Recorded mileage: 32,985

Recorded mileage: 32,985


MOT TEST: 26 February 2010 15:12:31 FAILED
MOT TEST: 26 February 2010 15:12:31 FAILED

This test (101357550470) was completed on the 26 February 2010 15:12:31 and FAILED the requirements for a valid MOT with 4 comments.

This test (101357550470) was completed on the 26 February 2010 15:12:31 and FAILED the requirements for a valid MOT with 4 comments.

Recorded mileage: 32,970

Recorded mileage: 32,970


FAIL

USER ENTERED


MOT TEST: 10 May 2007 10:39:48 PASSED
MOT TEST: 10 May 2007 10:39:48 PASSED

This test (320160037105) was completed on the 10 May 2007 10:39:48 and PASSED the requirements for a valid MOT with 0 comments.

This test (320160037105) was completed on the 10 May 2007 10:39:48 and PASSED the requirements for a valid MOT with 0 comments.

Recorded mileage: 32,778

Recorded mileage: 32,778


MOT TEST: 23 May 2006 10:42:38 PASSED
MOT TEST: 23 May 2006 10:42:38 PASSED

This test (373013646166) was completed on the 23 May 2006 10:42:38 and PASSED the requirements for a valid MOT with 0 comments.

This test (373013646166) was completed on the 23 May 2006 10:42:38 and PASSED the requirements for a valid MOT with 0 comments.

Recorded mileage: 32,628

Recorded mileage: 32,628