597 0KV


5970KV is registered to a Black 1964, Morris Minor with a Petrol engine. It Passed its most recent MOT Test on the 30 April 2019

13 unique faults (15 Total) reported in its MOT History (15 Tests).

2 common/recurring faults, the most frequent (2 times) is: Front Exhaust has a minor leak of exhaust gases (7.1.2).

80% (12) MOT Pass Rate and a 20% (3) MOT Failure Rate.

5,855 recorded miles.

597 0KV


5970KV is registered to a Black 1964, Morris Minor with a Petrol engine. It Passed its most recent MOT Test on the 30 April 2019

13 unique faults (15 Total) reported in its MOT History (15 Tests).

2 common/recurring faults, the most frequent (2 times) is: Front Exhaust has a minor leak of exhaust gases (7.1.2).

80% (12) MOT Pass Rate and a 20% (3) MOT Failure Rate.

5,855 recorded miles.

MOT PASS/Failure rate for 597 0KV

all MOT test results for 597 0KV represented as a percentage
MOT PASS/Failure rate for 597 0KV
all MOT test results for 597 0KV represented as a percentage

PERCENTAGE OF VEHICLE FAULTS WITH 597 0KV

ALL REPORTED FAULTS, DISPLAYED BY PERCENTAGE OF OCCURRENCE DURING ALL MOT TESTS
PERCENTAGE OF VEHICLE FAULTS WITH 597 0KV
ALL REPORTED FAULTS, DISPLAYED BY PERCENTAGE OF OCCURRENCE DURING ALL MOT TESTS
ADVISORY

FAIL

597 0KV annual Faults by type

ALL REPORTED FAULTS, DISPLAYED over time and categorised by type
597 0KV annual Faults by type
ALL REPORTED FAULTS, DISPLAYED over time and categorised by type

RECURRING FAULTS WITH 597 0KV

FAULTS THAT HAVE OCCURED MORE THAN ONCE DURING 597 0KV's MOT HISTORY
RECURRING FAULTS WITH 597 0KV
FAULTS THAT HAVE OCCURED MORE THAN ONCE DURING 597 0KV's MOT HISTORY
Fault Fault Test Date Test Date/Time Reference MOT Test Reference
2 Front exhaust has a minor leak of exhaust gases (7.1.2) Front exhaust has a minor leak of exhaust gases (7.1.2) 20 March 2012 [15:46] 20/03/2012 17 March 2012 [11:45] 17/03/2012 597120882046 597120882046 606417872050 606417872050
2 Front tyre worn close to the legal limit (4.1.e.1) Front tyre worn close to the legal limit (4.1.e.1) 05 March 2009 [14:59] 05/03/2009 25 February 2009 [13:20] 25/02/2009 772174169066 772174169066 161796559476 161796559476

ALL 597 0KV ADVISORIES [6]

ALL ADVISORIES, ORDERED by OCCURRENCE DURING 597 0KV's MOT HISTORY
ALL 597 0KV ADVISORIES [6]
ALL ADVISORIES, ORDERED by OCCURRENCE DURING 597 0KV's MOT HISTORY
Advisory Faults | source www.vehiclestats.co.uk
Fault Fault Test Date Test Date/Time Reference MOT Test Reference
2 Front exhaust has a minor leak of exhaust gases (7.1.2) Front exhaust has a minor leak of exhaust gases (7.1.2) 20 March 2012 [15:46] 20/03/2012 17 March 2012 [11:45] 17/03/2012 597120882046 597120882046 606417872050 606417872050
2 Front tyre worn close to the legal limit (4.1.e.1) Front tyre worn close to the legal limit (4.1.e.1) 05 March 2009 [14:59] 05/03/2009 25 February 2009 [13:20] 25/02/2009 772174169066 772174169066 161796559476 161796559476
1 Nearside front wheel bearing has slight play (5.1.3 (a) (i)) Nearside front wheel bearing has slight play (5.1.3 (a) (i)) 30 April 2019 [08:36] 30/04/2019 466600079707 466600079707
1 Nearside front tyre worn close to the legal limit (4.1.e.1) Nearside front tyre worn close to the legal limit (4.1.e.1) 20 March 2012 [15:46] 20/03/2012 597120882046 597120882046

ALL 597 0KV Failure Faults [9]

ALL Failure faults, ORDERED by OCCURRENCE DURING 597 0KV's MOT HISTORY
ALL 597 0KV Failure Faults [9]
ALL Failure faults, ORDERED by OCCURRENCE DURING 597 0KV's MOT HISTORY
Fail Faults | source www.vehiclestats.co.uk
Fault Fault Test Date Test Date/Time Reference MOT Test Reference
1 Offside front headlamp not working on dipped beam (1.7.5a) Offside front headlamp not working on dipped beam (1.7.5a) 27 March 2015 [11:02] 27/03/2015 898266785023 898266785023
1 Nearside front tyre tread depth below requirements of 1.6mm (4.1.e.1) Nearside front tyre tread depth below requirements of 1.6mm (4.1.e.1) 17 March 2012 [11:45] 17/03/2012 606417872050 606417872050
1 Nearside rear brake binding (3.7.b.1) Nearside rear brake binding (3.7.b.1) 17 March 2012 [11:45] 17/03/2012 606417872050 606417872050
1 Offside rear parking brake recording little or no effort (3.7.b.6a) Offside rear parking brake recording little or no effort (3.7.b.6a) 17 March 2012 [11:45] 17/03/2012 606417872050 606417872050
1 Nearside rear rear position lamp(s) excessively deteriorated so that it is not visible from a reasonable distance (1.1.a.3d) Nearside rear rear position lamp(s) excessively deteriorated so that it is not visible from a reasonable distance (1.1.a.3d) 25 February 2009 [13:20] 25/02/2009 161796559476 161796559476
1 Front headlamp not working on main beam (1.7.5a) Front headlamp not working on main beam (1.7.5a) 25 February 2009 [13:20] 25/02/2009 161796559476 161796559476
1 Front passenger seat insecure (6.2.3) Front passenger seat insecure (6.2.3) 25 February 2009 [13:20] 25/02/2009 161796559476 161796559476
1 Nearside front windscreen washer provides insufficient washer liquid (8.2.3) Nearside front windscreen washer provides insufficient washer liquid (8.2.3) 25 February 2009 [13:20] 25/02/2009 161796559476 161796559476
1 Front shock absorber has an excessively worn bush (2.7.4) Front shock absorber has an excessively worn bush (2.7.4) 25 February 2009 [13:20] 25/02/2009 161796559476 161796559476

MOT TEST: 30 April 2019 08:36:39 PASSED
MOT TEST: 30 April 2019 08:36:39 PASSED

This test (466600079707) was completed on the 30 April 2019 08:36:39 and PASSED the requirements for a valid MOT with 1 comments.

This test (466600079707) was completed on the 30 April 2019 08:36:39 and PASSED the requirements for a valid MOT with 1 comments.

Recorded mileage: 5,855

Recorded mileage: 5,855


ADVISORY


MOT TEST: 27 March 2018 13:29:02 PASSED
MOT TEST: 27 March 2018 13:29:02 PASSED

This test (114812913118) was completed on the 27 March 2018 13:29:02 and PASSED the requirements for a valid MOT with 0 comments.

This test (114812913118) was completed on the 27 March 2018 13:29:02 and PASSED the requirements for a valid MOT with 0 comments.

Recorded mileage: 5,596

Recorded mileage: 5,596


MOT TEST: 29 March 2017 08:59:19 PASSED
MOT TEST: 29 March 2017 08:59:19 PASSED

This test (506562490348) was completed on the 29 March 2017 08:59:19 and PASSED the requirements for a valid MOT with 0 comments.

This test (506562490348) was completed on the 29 March 2017 08:59:19 and PASSED the requirements for a valid MOT with 0 comments.

Recorded mileage: 5,093

Recorded mileage: 5,093


MOT TEST: 17 March 2016 11:03:05 PASSED
MOT TEST: 17 March 2016 11:03:05 PASSED

This test (790618311480) was completed on the 17 March 2016 11:03:05 and PASSED the requirements for a valid MOT with 0 comments.

This test (790618311480) was completed on the 17 March 2016 11:03:05 and PASSED the requirements for a valid MOT with 0 comments.

Recorded mileage: 4,705

Recorded mileage: 4,705


MOT TEST: 30 March 2015 10:19:07 PASSED
MOT TEST: 30 March 2015 10:19:07 PASSED

This test (528089185053) was completed on the 30 March 2015 10:19:07 and PASSED the requirements for a valid MOT with 0 comments.

This test (528089185053) was completed on the 30 March 2015 10:19:07 and PASSED the requirements for a valid MOT with 0 comments.

Recorded mileage: 3,782

Recorded mileage: 3,782


MOT TEST: 27 March 2015 11:02:56 FAILED
MOT TEST: 27 March 2015 11:02:56 FAILED

This test (898266785023) was completed on the 27 March 2015 11:02:56 and FAILED the requirements for a valid MOT with 1 comments.

This test (898266785023) was completed on the 27 March 2015 11:02:56 and FAILED the requirements for a valid MOT with 1 comments.

Recorded mileage: 3,782

Recorded mileage: 3,782


FAIL


MOT TEST: 01 April 2014 13:39:08 PASSED
MOT TEST: 01 April 2014 13:39:08 PASSED

This test (417941194086) was completed on the 01 April 2014 13:39:08 and PASSED the requirements for a valid MOT with 0 comments.

This test (417941194086) was completed on the 01 April 2014 13:39:08 and PASSED the requirements for a valid MOT with 0 comments.

Recorded mileage: 3,050

Recorded mileage: 3,050


MOT TEST: 20 March 2012 15:46:05 PASSED
MOT TEST: 20 March 2012 15:46:05 PASSED

This test (597120882046) was completed on the 20 March 2012 15:46:05 and PASSED the requirements for a valid MOT with 2 comments.

This test (597120882046) was completed on the 20 March 2012 15:46:05 and PASSED the requirements for a valid MOT with 2 comments.

Recorded mileage: 2,920

Recorded mileage: 2,920


ADVISORY


MOT TEST: 17 March 2012 11:45:10 FAILED
MOT TEST: 17 March 2012 11:45:10 FAILED

This test (606417872050) was completed on the 17 March 2012 11:45:10 and FAILED the requirements for a valid MOT with 4 comments.

This test (606417872050) was completed on the 17 March 2012 11:45:10 and FAILED the requirements for a valid MOT with 4 comments.

Recorded mileage: 2,920

Recorded mileage: 2,920


ADVISORY

FAIL


MOT TEST: 21 April 2010 15:30:06 PASSED
MOT TEST: 21 April 2010 15:30:06 PASSED

This test (674471510160) was completed on the 21 April 2010 15:30:06 and PASSED the requirements for a valid MOT with 0 comments.

This test (674471510160) was completed on the 21 April 2010 15:30:06 and PASSED the requirements for a valid MOT with 0 comments.

Recorded mileage: 2,472

Recorded mileage: 2,472


MOT TEST: 05 March 2009 14:59:25 PASSED
MOT TEST: 05 March 2009 14:59:25 PASSED

This test (772174169066) was completed on the 05 March 2009 14:59:25 and PASSED the requirements for a valid MOT with 1 comments.

This test (772174169066) was completed on the 05 March 2009 14:59:25 and PASSED the requirements for a valid MOT with 1 comments.

Recorded mileage: 2,076

Recorded mileage: 2,076


ADVISORY


MOT TEST: 25 February 2009 13:20:21 FAILED
MOT TEST: 25 February 2009 13:20:21 FAILED

This test (161796559476) was completed on the 25 February 2009 13:20:21 and FAILED the requirements for a valid MOT with 6 comments.

This test (161796559476) was completed on the 25 February 2009 13:20:21 and FAILED the requirements for a valid MOT with 6 comments.

Recorded mileage: 2,075

Recorded mileage: 2,075


ADVISORY

FAIL


MOT TEST: 15 March 2008 10:49:02 PASSED
MOT TEST: 15 March 2008 10:49:02 PASSED

This test (134835278485) was completed on the 15 March 2008 10:49:02 and PASSED the requirements for a valid MOT with 0 comments.

This test (134835278485) was completed on the 15 March 2008 10:49:02 and PASSED the requirements for a valid MOT with 0 comments.

Recorded mileage: 1,843

Recorded mileage: 1,843


MOT TEST: 28 February 2007 11:33:05 PASSED
MOT TEST: 28 February 2007 11:33:05 PASSED

This test (110539057089) was completed on the 28 February 2007 11:33:05 and PASSED the requirements for a valid MOT with 0 comments.

This test (110539057089) was completed on the 28 February 2007 11:33:05 and PASSED the requirements for a valid MOT with 0 comments.

Recorded mileage: 1,561

Recorded mileage: 1,561


MOT TEST: 21 February 2006 10:39:34 PASSED
MOT TEST: 21 February 2006 10:39:34 PASSED

This test (383182356087) was completed on the 21 February 2006 10:39:34 and PASSED the requirements for a valid MOT with 0 comments.

This test (383182356087) was completed on the 21 February 2006 10:39:34 and PASSED the requirements for a valid MOT with 0 comments.

Recorded mileage: 1,357

Recorded mileage: 1,357