597 YUP


597YUP is registered to a Grey 1961, Morris Minor with a Petrol engine. It Failed its most recent MOT Test on the 20 April 2017

12 unique faults (15 Total) reported in its MOT History (7 Tests).

2 common/recurring faults, the most frequent (3 times) is: Nearside Track rod end ball joint has slight play (2.2.B.1f).

71% (5) MOT Pass Rate and a 29% (2) MOT Failure Rate.

94,983 recorded miles.

597 YUP


597YUP is registered to a Grey 1961, Morris Minor with a Petrol engine. It Failed its most recent MOT Test on the 20 April 2017

12 unique faults (15 Total) reported in its MOT History (7 Tests).

2 common/recurring faults, the most frequent (3 times) is: Nearside Track rod end ball joint has slight play (2.2.B.1f).

71% (5) MOT Pass Rate and a 29% (2) MOT Failure Rate.

94,983 recorded miles.

MOT PASS/Failure rate for 597 YUP

all MOT test results for 597 YUP represented as a percentage
MOT PASS/Failure rate for 597 YUP
all MOT test results for 597 YUP represented as a percentage

PERCENTAGE OF VEHICLE FAULTS WITH 597 YUP

ALL REPORTED FAULTS, DISPLAYED BY PERCENTAGE OF OCCURRENCE DURING ALL MOT TESTS
PERCENTAGE OF VEHICLE FAULTS WITH 597 YUP
ALL REPORTED FAULTS, DISPLAYED BY PERCENTAGE OF OCCURRENCE DURING ALL MOT TESTS
ADVISORY

FAIL

USER ENTERED

PASS WITH RECTIFICATION

597 YUP annual Faults by type

ALL REPORTED FAULTS, DISPLAYED over time and categorised by type
597 YUP annual Faults by type
ALL REPORTED FAULTS, DISPLAYED over time and categorised by type

RECURRING FAULTS WITH 597 YUP

FAULTS THAT HAVE OCCURED MORE THAN ONCE DURING 597 YUP's MOT HISTORY
RECURRING FAULTS WITH 597 YUP
FAULTS THAT HAVE OCCURED MORE THAN ONCE DURING 597 YUP's MOT HISTORY
Fault Fault Test Date Test Date/Time Reference MOT Test Reference
3 Nearside track rod end ball joint has slight play (2.2.b.1f) Nearside track rod end ball joint has slight play (2.2.b.1f) 20 April 2017 [09:52] 20/04/2017 20 April 2017 [09:52] 20/04/2017 03 May 2016 [14:21] 03/05/2016 268619501062 268619501062 606298299137 606298299137 247038665009 247038665009
2 Offside front suspension has slight play in a lower suspension ball joint at lower trunion (2.5.b.1a) Offside front suspension has slight play in a lower suspension ball joint at lower trunion (2.5.b.1a) 20 April 2017 [09:52] 20/04/2017 20 April 2017 [09:52] 20/04/2017 268619501062 268619501062 606298299137 606298299137

ALL 597 YUP ADVISORIES [7]

ALL ADVISORIES, ORDERED by OCCURRENCE DURING 597 YUP's MOT HISTORY
ALL 597 YUP ADVISORIES [7]
ALL ADVISORIES, ORDERED by OCCURRENCE DURING 597 YUP's MOT HISTORY
Advisory Faults | source www.vehiclestats.co.uk
Fault Fault Test Date Test Date/Time Reference MOT Test Reference
3 Nearside track rod end ball joint has slight play (2.2.b.1f) Nearside track rod end ball joint has slight play (2.2.b.1f) 20 April 2017 [09:52] 20/04/2017 20 April 2017 [09:52] 20/04/2017 03 May 2016 [14:21] 03/05/2016 268619501062 268619501062 606298299137 606298299137 247038665009 247038665009
2 Offside front suspension has slight play in a lower suspension ball joint at lower trunion (2.5.b.1a) Offside front suspension has slight play in a lower suspension ball joint at lower trunion (2.5.b.1a) 20 April 2017 [09:52] 20/04/2017 20 April 2017 [09:52] 20/04/2017 268619501062 268619501062 606298299137 606298299137
1 Nearside front steering pivot point has slight play (2.2.b.1g) Nearside front steering pivot point has slight play (2.2.b.1g) 07 May 2013 [15:41] 07/05/2013 165987423124 165987423124
1 Offside front steering pivot point has slight play (2.2.b.1g) Offside front steering pivot point has slight play (2.2.b.1g) 07 May 2013 [15:41] 07/05/2013 165987423124 165987423124

ALL 597 YUP Failure Faults [2]

ALL Failure faults, ORDERED by OCCURRENCE DURING 597 YUP's MOT HISTORY
ALL 597 YUP Failure Faults [2]
ALL Failure faults, ORDERED by OCCURRENCE DURING 597 YUP's MOT HISTORY
Fail Faults | source www.vehiclestats.co.uk
Fault Fault Test Date Test Date/Time Reference MOT Test Reference
1 Direction indicators have less than 50% of the light sources illuminating (1.4.a.2c) Direction indicators have less than 50% of the light sources illuminating (1.4.a.2c) 28 April 2015 [13:28] 28/04/2015 777868415115 777868415115
1 Nearside front wheel bearing has excessive play (2.5.a.3c) Nearside front wheel bearing has excessive play (2.5.a.3c) 28 April 2015 [13:28] 28/04/2015 777868415115 777868415115

ALL 597 YUP User Entered Faults [5]

ALL User Entered faults, ORDERED by OCCURRENCE DURING 597 YUP's MOT HISTORY
ALL 597 YUP User Entered Faults [5]
ALL User Entered faults, ORDERED by OCCURRENCE DURING 597 YUP's MOT HISTORY
User Entered Faults | source www.vehiclestats.co.uk
Fault Fault Test Date Test Date/Time Reference MOT Test Reference
1 Exhaust loose at manifold Exhaust loose at manifold 02 May 2014 [17:31] 02/05/2014 768542324131 768542324131
1 Exhaust rear mounting Exhaust rear mounting 02 May 2014 [17:31] 02/05/2014 768542324131 768542324131
1 N/s upper & lower trunions worn N/s upper & lower trunions worn 02 May 2014 [17:31] 02/05/2014 768542324131 768542324131
1 O/s lower trunion worn O/s lower trunion worn 02 May 2014 [17:31] 02/05/2014 768542324131 768542324131
1 Oil leak Oil leak 07 May 2013 [15:41] 07/05/2013 165987423124 165987423124

ALL 597 YUP Pass With Rectification Faults [1]

ALL Pass With Rectification faults, ORDERED by OCCURRENCE DURING 597 YUP's MOT HISTORY
ALL 597 YUP Pass With Rectification Faults [1]
ALL Pass With Rectification faults, ORDERED by OCCURRENCE DURING 597 YUP's MOT HISTORY
Advisory Faults | source www.vehiclestats.co.uk
Fault Fault Test Date Test Date/Time Reference MOT Test Reference
1 Exhaust system not adequately supported at tail pipe (7.1.1) Exhaust system not adequately supported at tail pipe (7.1.1) 20 April 2017 [09:52] 20/04/2017 606298299137 606298299137

MOT TEST: 20 April 2017 09:52:22 PASSED
MOT TEST: 20 April 2017 09:52:22 PASSED

This test (268619501062) was completed on the 20 April 2017 09:52:22 and PASSED the requirements for a valid MOT with 2 comments.

This test (268619501062) was completed on the 20 April 2017 09:52:22 and PASSED the requirements for a valid MOT with 2 comments.

Recorded mileage: 94,983

Recorded mileage: 94,983


ADVISORY


MOT TEST: 20 April 2017 09:52:21 FAILED
MOT TEST: 20 April 2017 09:52:21 FAILED

This test (606298299137) was completed on the 20 April 2017 09:52:21 and FAILED the requirements for a valid MOT with 3 comments.

This test (606298299137) was completed on the 20 April 2017 09:52:21 and FAILED the requirements for a valid MOT with 3 comments.

Recorded mileage: 94,983

Recorded mileage: 94,983


ADVISORY

PASS WITH RECTIFICATION


MOT TEST: 03 May 2016 14:21:02 PASSED
MOT TEST: 03 May 2016 14:21:02 PASSED

This test (247038665009) was completed on the 03 May 2016 14:21:02 and PASSED the requirements for a valid MOT with 1 comments.

This test (247038665009) was completed on the 03 May 2016 14:21:02 and PASSED the requirements for a valid MOT with 1 comments.

Recorded mileage: 94,759

Recorded mileage: 94,759


ADVISORY


MOT TEST: 29 April 2015 09:45:53 PASSED
MOT TEST: 29 April 2015 09:45:53 PASSED

This test (979409115186) was completed on the 29 April 2015 09:45:53 and PASSED the requirements for a valid MOT with 0 comments.

This test (979409115186) was completed on the 29 April 2015 09:45:53 and PASSED the requirements for a valid MOT with 0 comments.

Recorded mileage: 94,422

Recorded mileage: 94,422


MOT TEST: 28 April 2015 13:28:54 FAILED
MOT TEST: 28 April 2015 13:28:54 FAILED

This test (777868415115) was completed on the 28 April 2015 13:28:54 and FAILED the requirements for a valid MOT with 2 comments.

This test (777868415115) was completed on the 28 April 2015 13:28:54 and FAILED the requirements for a valid MOT with 2 comments.

Recorded mileage: 94,422

Recorded mileage: 94,422


FAIL


MOT TEST: 02 May 2014 17:31:42 PASSED
MOT TEST: 02 May 2014 17:31:42 PASSED

This test (768542324131) was completed on the 02 May 2014 17:31:42 and PASSED the requirements for a valid MOT with 4 comments.

This test (768542324131) was completed on the 02 May 2014 17:31:42 and PASSED the requirements for a valid MOT with 4 comments.

Recorded mileage: 94,172

Recorded mileage: 94,172


USER ENTERED


MOT TEST: 07 May 2013 15:41:30 PASSED
MOT TEST: 07 May 2013 15:41:30 PASSED

This test (165987423124) was completed on the 07 May 2013 15:41:30 and PASSED the requirements for a valid MOT with 3 comments.

This test (165987423124) was completed on the 07 May 2013 15:41:30 and PASSED the requirements for a valid MOT with 3 comments.

Recorded mileage: 93,729

Recorded mileage: 93,729


ADVISORY

USER ENTERED