599 WKK


599WKK is registered to a Grey 1962, Morris Minor with a Petrol engine. It Failed its most recent MOT Test on the 23 June 2017

28 unique faults (33 Total) reported in its MOT History (8 Tests).

4 common/recurring faults, the most frequent (3 times) is: General corrosion to chassis underside.

50% (4) MOT Pass Rate and a 50% (4) MOT Failure Rate.

13,309 recorded miles.

599 WKK


599WKK is registered to a Grey 1962, Morris Minor with a Petrol engine. It Failed its most recent MOT Test on the 23 June 2017

28 unique faults (33 Total) reported in its MOT History (8 Tests).

4 common/recurring faults, the most frequent (3 times) is: General corrosion to chassis underside.

50% (4) MOT Pass Rate and a 50% (4) MOT Failure Rate.

13,309 recorded miles.

MOT PASS/Failure rate for 599 WKK

all MOT test results for 599 WKK represented as a percentage
MOT PASS/Failure rate for 599 WKK
all MOT test results for 599 WKK represented as a percentage

PERCENTAGE OF VEHICLE FAULTS WITH 599 WKK

ALL REPORTED FAULTS, DISPLAYED BY PERCENTAGE OF OCCURRENCE DURING ALL MOT TESTS
PERCENTAGE OF VEHICLE FAULTS WITH 599 WKK
ALL REPORTED FAULTS, DISPLAYED BY PERCENTAGE OF OCCURRENCE DURING ALL MOT TESTS
ADVISORY

FAIL

599 WKK annual Faults by type

ALL REPORTED FAULTS, DISPLAYED over time and categorised by type
599 WKK annual Faults by type
ALL REPORTED FAULTS, DISPLAYED over time and categorised by type

RECURRING FAULTS WITH 599 WKK

FAULTS THAT HAVE OCCURED MORE THAN ONCE DURING 599 WKK's MOT HISTORY
RECURRING FAULTS WITH 599 WKK
FAULTS THAT HAVE OCCURED MORE THAN ONCE DURING 599 WKK's MOT HISTORY
Fault Fault Test Date Test Date/Time Reference MOT Test Reference
3 General corrosion to chassis underside General corrosion to chassis underside 23 June 2017 [09:59] 23/06/2017 16 June 2017 [12:17] 16/06/2017 29 June 2016 [13:40] 29/06/2016 128123214730 128123214730 212320508346 212320508346 827681296133 827681296133
2 Oil leak () Oil leak () 23 June 2017 [09:59] 23/06/2017 16 June 2017 [12:17] 16/06/2017 128123214730 128123214730 212320508346 212320508346
2 Differential oil leak Differential oil leak 23 June 2017 [09:59] 23/06/2017 16 June 2017 [12:17] 16/06/2017 128123214730 128123214730 212320508346 212320508346
2 Nearside rear stub axle slight misting of oil Nearside rear stub axle slight misting of oil 23 June 2017 [09:59] 23/06/2017 16 June 2017 [12:17] 16/06/2017 128123214730 128123214730 212320508346 212320508346

ALL 599 WKK ADVISORIES [14]

ALL ADVISORIES, ORDERED by OCCURRENCE DURING 599 WKK's MOT HISTORY
ALL 599 WKK ADVISORIES [14]
ALL ADVISORIES, ORDERED by OCCURRENCE DURING 599 WKK's MOT HISTORY
Advisory Faults | source www.vehiclestats.co.uk
Fault Fault Test Date Test Date/Time Reference MOT Test Reference
3 General corrosion to chassis underside General corrosion to chassis underside 23 June 2017 [09:59] 23/06/2017 16 June 2017 [12:17] 16/06/2017 29 June 2016 [13:40] 29/06/2016 128123214730 128123214730 212320508346 212320508346 827681296133 827681296133
2 Oil leak () Oil leak () 23 June 2017 [09:59] 23/06/2017 16 June 2017 [12:17] 16/06/2017 128123214730 128123214730 212320508346 212320508346
2 Differential oil leak Differential oil leak 23 June 2017 [09:59] 23/06/2017 16 June 2017 [12:17] 16/06/2017 128123214730 128123214730 212320508346 212320508346
2 Nearside rear stub axle slight misting of oil Nearside rear stub axle slight misting of oil 23 June 2017 [09:59] 23/06/2017 16 June 2017 [12:17] 16/06/2017 128123214730 128123214730 212320508346 212320508346
1 Oil leak Oil leak 29 June 2016 [13:40] 29/06/2016 827681296133 827681296133
1 Diff oil leak Diff oil leak 29 June 2016 [13:40] 29/06/2016 827681296133 827681296133
1 Oil leak rear diff Oil leak rear diff 09 June 2016 [08:39] 09/06/2016 676049716264 676049716264
1 Oil leak engine Oil leak engine 09 June 2016 [08:39] 09/06/2016 676049716264 676049716264
1 General light corrosion to chassis General light corrosion to chassis 09 June 2016 [08:39] 09/06/2016 676049716264 676049716264

ALL 599 WKK Failure Faults [19]

ALL Failure faults, ORDERED by OCCURRENCE DURING 599 WKK's MOT HISTORY
ALL 599 WKK Failure Faults [19]
ALL Failure faults, ORDERED by OCCURRENCE DURING 599 WKK's MOT HISTORY
Advisory Faults | source www.vehiclestats.co.uk
Fault Fault Test Date Test Date/Time Reference MOT Test Reference
1 Nearside front hydraulic brake cylinder leaking hydraulic fluid front of hub (3.6.a.1) Nearside front hydraulic brake cylinder leaking hydraulic fluid front of hub (3.6.a.1) 16 June 2017 [12:17] 16/06/2017 212320508346 212320508346
1 Nearside front brakes imbalanced across an axle (3.7.b.5b) Nearside front brakes imbalanced across an axle (3.7.b.5b) 16 June 2017 [12:17] 16/06/2017 212320508346 212320508346
1 Front brakes imbalanced across an axle (3.7.b.5b) Front brakes imbalanced across an axle (3.7.b.5b) 09 June 2016 [08:39] 09/06/2016 676049716264 676049716264
1 Nearside rear brake pipe leaking into cylinder area (3.6.a.1) Nearside rear brake pipe leaking into cylinder area (3.6.a.1) 09 June 2016 [08:39] 09/06/2016 676049716264 676049716264
1 Nearside front front brake recording little or no effort (3.7.b.5a) Nearside front front brake recording little or no effort (3.7.b.5a) 09 June 2016 [08:39] 09/06/2016 676049716264 676049716264
1 Nearside rear rear brake binding (3.7.b.1) Nearside rear rear brake binding (3.7.b.1) 13 October 2014 [12:15] 13/10/2014 455176884239 455176884239
1 Offside headlamp not working on dipped beam (1.7.5a) Offside headlamp not working on dipped beam (1.7.5a) 13 October 2014 [12:15] 13/10/2014 455176884239 455176884239
1 Headlamp switch faulty (1.7.1) Headlamp switch faulty (1.7.1) 13 October 2014 [12:15] 13/10/2014 455176884239 455176884239
1 Nearside headlamp not working on dipped beam (1.7.5a) Nearside headlamp not working on dipped beam (1.7.5a) 26 March 2007 [12:04] 26/03/2007 103505087441 103505087441
1 Registration plate lamp not working (1.1.5c) Registration plate lamp not working (1.1.5c) 26 March 2007 [12:04] 26/03/2007 103505087441 103505087441
1 Offside front brake pipe excessively corroded (3.6.b.2c) Offside front brake pipe excessively corroded (3.6.b.2c) 26 March 2007 [12:04] 26/03/2007 103505087441 103505087441
1 Nearside steering rack gaiter split (2.2.d.2d) Nearside steering rack gaiter split (2.2.d.2d) 26 March 2007 [12:04] 26/03/2007 103505087441 103505087441
1 Exhaust has a major leak of exhaust gases (7.1.2) Exhaust has a major leak of exhaust gases (7.1.2) 26 March 2007 [12:04] 26/03/2007 103505087441 103505087441
1 Offside rear suspension spring mounting prescribed area is excessively corroded (2.4.a.3) Offside rear suspension spring mounting prescribed area is excessively corroded (2.4.a.3) 26 March 2007 [12:04] 26/03/2007 103505087441 103505087441
1 Offside suspension component mounting prescribed area is excessively corroded (2.4.a.3) Offside suspension component mounting prescribed area is excessively corroded (2.4.a.3) 26 March 2007 [12:04] 26/03/2007 103505087441 103505087441
1 Offside rear shock absorber has a serious fluid leak (2.7.3) Offside rear shock absorber has a serious fluid leak (2.7.3) 26 March 2007 [12:04] 26/03/2007 103505087441 103505087441
1 Service brake: efficiency below requirements (3.7.b.7) Service brake: efficiency below requirements (3.7.b.7) 26 March 2007 [12:04] 26/03/2007 103505087441 103505087441
1 Parking brake: efficiency below requirements (3.7.b.7) Parking brake: efficiency below requirements (3.7.b.7) 26 March 2007 [12:04] 26/03/2007 103505087441 103505087441
1 Brakes imbalanced across an axle (3.7.b.5b) Brakes imbalanced across an axle (3.7.b.5b) 26 March 2007 [12:04] 26/03/2007 103505087441 103505087441

MOT TEST: 23 June 2017 09:59:47 PASSED
MOT TEST: 23 June 2017 09:59:47 PASSED

This test (128123214730) was completed on the 23 June 2017 09:59:47 and PASSED the requirements for a valid MOT with 4 comments.

This test (128123214730) was completed on the 23 June 2017 09:59:47 and PASSED the requirements for a valid MOT with 4 comments.

Recorded mileage: 13,309

Recorded mileage: 13,309


ADVISORY


MOT TEST: 16 June 2017 12:17:30 FAILED
MOT TEST: 16 June 2017 12:17:30 FAILED

This test (212320508346) was completed on the 16 June 2017 12:17:30 and FAILED the requirements for a valid MOT with 6 comments.

This test (212320508346) was completed on the 16 June 2017 12:17:30 and FAILED the requirements for a valid MOT with 6 comments.

Recorded mileage: 13,308

Recorded mileage: 13,308


ADVISORY

FAIL


MOT TEST: 29 June 2016 13:40:36 PASSED
MOT TEST: 29 June 2016 13:40:36 PASSED

This test (827681296133) was completed on the 29 June 2016 13:40:36 and PASSED the requirements for a valid MOT with 3 comments.

This test (827681296133) was completed on the 29 June 2016 13:40:36 and PASSED the requirements for a valid MOT with 3 comments.

Recorded mileage: 13,264

Recorded mileage: 13,264


ADVISORY


MOT TEST: 09 June 2016 08:39:59 FAILED
MOT TEST: 09 June 2016 08:39:59 FAILED

This test (676049716264) was completed on the 09 June 2016 08:39:59 and FAILED the requirements for a valid MOT with 6 comments.

This test (676049716264) was completed on the 09 June 2016 08:39:59 and FAILED the requirements for a valid MOT with 6 comments.

Recorded mileage: 13,263

Recorded mileage: 13,263


ADVISORY

FAIL


MOT TEST: 17 October 2014 11:29:36 PASSED
MOT TEST: 17 October 2014 11:29:36 PASSED

This test (556170794240) was completed on the 17 October 2014 11:29:36 and PASSED the requirements for a valid MOT with 0 comments.

This test (556170794240) was completed on the 17 October 2014 11:29:36 and PASSED the requirements for a valid MOT with 0 comments.

Recorded mileage: 13,182

Recorded mileage: 13,182


MOT TEST: 13 October 2014 12:15:39 FAILED
MOT TEST: 13 October 2014 12:15:39 FAILED

This test (455176884239) was completed on the 13 October 2014 12:15:39 and FAILED the requirements for a valid MOT with 3 comments.

This test (455176884239) was completed on the 13 October 2014 12:15:39 and FAILED the requirements for a valid MOT with 3 comments.

Recorded mileage: 13,181

Recorded mileage: 13,181


FAIL


MOT TEST: 17 May 2007 17:05:19 PASSED
MOT TEST: 17 May 2007 17:05:19 PASSED

This test (254227937481) was completed on the 17 May 2007 17:05:19 and PASSED the requirements for a valid MOT with 0 comments.

This test (254227937481) was completed on the 17 May 2007 17:05:19 and PASSED the requirements for a valid MOT with 0 comments.

Recorded mileage: 13,030

Recorded mileage: 13,030


MOT TEST: 26 March 2007 12:04:32 FAILED
MOT TEST: 26 March 2007 12:04:32 FAILED

This test (103505087441) was completed on the 26 March 2007 12:04:32 and FAILED the requirements for a valid MOT with 11 comments.

This test (103505087441) was completed on the 26 March 2007 12:04:32 and FAILED the requirements for a valid MOT with 11 comments.

Recorded mileage: 13,019

Recorded mileage: 13,019


FAIL