59GEW


59GEW is registered to a White 1971, Morris Mini cooper s with a Petrol engine. It Failed its most recent MOT Test on the 05 June 2017

18 unique faults (24 Total) reported in its MOT History (12 Tests).

6 common/recurring faults, the most frequent (2 times) is: Nearside rear brake recording little or no effort (3.7.B.5a).

58% (7) MOT Pass Rate and a 42% (5) MOT Failure Rate.

6,873 recorded miles.

59GEW


59GEW is registered to a White 1971, Morris Mini cooper s with a Petrol engine. It Failed its most recent MOT Test on the 05 June 2017

18 unique faults (24 Total) reported in its MOT History (12 Tests).

6 common/recurring faults, the most frequent (2 times) is: Nearside rear brake recording little or no effort (3.7.B.5a).

58% (7) MOT Pass Rate and a 42% (5) MOT Failure Rate.

6,873 recorded miles.

MOT PASS/Failure rate for 59GEW

all MOT test results for 59GEW represented as a percentage
MOT PASS/Failure rate for 59GEW
all MOT test results for 59GEW represented as a percentage

PERCENTAGE OF VEHICLE FAULTS WITH 59GEW

ALL REPORTED FAULTS, DISPLAYED BY PERCENTAGE OF OCCURRENCE DURING ALL MOT TESTS
PERCENTAGE OF VEHICLE FAULTS WITH 59GEW
ALL REPORTED FAULTS, DISPLAYED BY PERCENTAGE OF OCCURRENCE DURING ALL MOT TESTS
ADVISORY

FAIL

USER ENTERED

PASS WITH RECTIFICATION

59GEW annual Faults by type

ALL REPORTED FAULTS, DISPLAYED over time and categorised by type
59GEW annual Faults by type
ALL REPORTED FAULTS, DISPLAYED over time and categorised by type

RECURRING FAULTS WITH 59GEW

FAULTS THAT HAVE OCCURED MORE THAN ONCE DURING 59GEW's MOT HISTORY
RECURRING FAULTS WITH 59GEW
FAULTS THAT HAVE OCCURED MORE THAN ONCE DURING 59GEW's MOT HISTORY
Fault Fault Test Date Test Date/Time Reference MOT Test Reference
2 Nearside rear brake recording little or no effort (3.7.b.5a) Nearside rear brake recording little or no effort (3.7.b.5a) 23 July 2015 [14:52] 23/07/2015 07 July 2011 [11:43] 07/07/2011 335634805425 335634805425 166148381169 166148381169
2 Parking brake: efficiency below requirements (3.7.b.7) Parking brake: efficiency below requirements (3.7.b.7) 23 July 2015 [14:52] 23/07/2015 07 May 2013 [15:46] 07/05/2013 335634805425 335634805425 418067223146 418067223146
2 Nearside front wheel bearing has slight play (2.5.a.3c) Nearside front wheel bearing has slight play (2.5.a.3c) 14 July 2014 [16:32] 14/07/2014 14 July 2014 [11:33] 14/07/2014 298275794119 298275794119 796505094142 796505094142
2 Offside front wheel bearing has slight play (2.5.a.3c) Offside front wheel bearing has slight play (2.5.a.3c) 14 July 2014 [16:32] 14/07/2014 14 July 2014 [11:33] 14/07/2014 298275794119 298275794119 796505094142 796505094142
2 Both rear wheel bearings slightly noisy Both rear wheel bearings slightly noisy 14 July 2014 [16:32] 14/07/2014 14 July 2014 [11:33] 14/07/2014 298275794119 298275794119 796505094142 796505094142
2 Service brake: efficiency below requirements (3.7.b.7) Service brake: efficiency below requirements (3.7.b.7) 14 July 2014 [11:33] 14/07/2014 07 May 2013 [15:46] 07/05/2013 796505094142 796505094142 418067223146 418067223146

ALL 59GEW ADVISORIES [4]

ALL ADVISORIES, ORDERED by OCCURRENCE DURING 59GEW's MOT HISTORY
ALL 59GEW ADVISORIES [4]
ALL ADVISORIES, ORDERED by OCCURRENCE DURING 59GEW's MOT HISTORY
Advisory Faults | source www.vehiclestats.co.uk
Fault Fault Test Date Test Date/Time Reference MOT Test Reference
2 Nearside front wheel bearing has slight play (2.5.a.3c) Nearside front wheel bearing has slight play (2.5.a.3c) 14 July 2014 [16:32] 14/07/2014 14 July 2014 [11:33] 14/07/2014 298275794119 298275794119 796505094142 796505094142
2 Offside front wheel bearing has slight play (2.5.a.3c) Offside front wheel bearing has slight play (2.5.a.3c) 14 July 2014 [16:32] 14/07/2014 14 July 2014 [11:33] 14/07/2014 298275794119 298275794119 796505094142 796505094142

ALL 59GEW Failure Faults [16]

ALL Failure faults, ORDERED by OCCURRENCE DURING 59GEW's MOT HISTORY
ALL 59GEW Failure Faults [16]
ALL Failure faults, ORDERED by OCCURRENCE DURING 59GEW's MOT HISTORY
Fail Faults | source www.vehiclestats.co.uk
Fault Fault Test Date Test Date/Time Reference MOT Test Reference
2 Parking brake: efficiency below requirements (3.7.b.7) Parking brake: efficiency below requirements (3.7.b.7) 23 July 2015 [14:52] 23/07/2015 07 May 2013 [15:46] 07/05/2013 335634805425 335634805425 418067223146 418067223146
2 Service brake: efficiency below requirements (3.7.b.7) Service brake: efficiency below requirements (3.7.b.7) 14 July 2014 [11:33] 14/07/2014 07 May 2013 [15:46] 07/05/2013 796505094142 796505094142 418067223146 418067223146
1 Nearside front direction indicator incorrect colour (1.4.a.2f) Nearside front direction indicator incorrect colour (1.4.a.2f) 01 June 2017 [13:11] 01/06/2017 972568289079 972568289079
1 Offside front direction indicator incorrect colour (1.4.a.2f) Offside front direction indicator incorrect colour (1.4.a.2f) 01 June 2017 [13:11] 01/06/2017 972568289079 972568289079
1 Front windscreen washer provides insufficient washer liquid (8.2.3) Front windscreen washer provides insufficient washer liquid (8.2.3) 23 July 2015 [14:52] 23/07/2015 335634805425 335634805425
1 Nearside front upper suspension arm has excessive play in a ball joint (2.4.g.2) Nearside front upper suspension arm has excessive play in a ball joint (2.4.g.2) 23 July 2015 [14:52] 23/07/2015 335634805425 335634805425
1 Offside front upper suspension arm has excessive play in a ball joint (2.4.g.2) Offside front upper suspension arm has excessive play in a ball joint (2.4.g.2) 23 July 2015 [14:52] 23/07/2015 335634805425 335634805425
1 Nearside front steering rack gaiter split (2.2.d.2d) Nearside front steering rack gaiter split (2.2.d.2d) 23 July 2015 [14:52] 23/07/2015 335634805425 335634805425
1 Nearside rear brake recording little or no effort (3.7.b.5a) Nearside rear brake recording little or no effort (3.7.b.5a) 23 July 2015 [14:52] 23/07/2015 335634805425 335634805425
1 Brakes imbalanced across an axle (3.7.b.5b) Brakes imbalanced across an axle (3.7.b.5b) 23 July 2015 [14:52] 23/07/2015 335634805425 335634805425
1 Windscreen washer provides insufficient washer liquid (8.2.3) Windscreen washer provides insufficient washer liquid (8.2.3) 14 July 2014 [11:33] 14/07/2014 796505094142 796505094142
1 Offside front seat belt insecurely fixed to the vehicles structure (5.2.1a) Offside front seat belt insecurely fixed to the vehicles structure (5.2.1a) 14 July 2014 [11:33] 14/07/2014 796505094142 796505094142
1 Front position lamp(s) not working (1.1.a.3b) Front position lamp(s) not working (1.1.a.3b) 14 July 2014 [11:33] 14/07/2014 796505094142 796505094142
1 Anti-roll bar linkage has excessive play in a ball joint (2.4.g.2) Anti-roll bar linkage has excessive play in a ball joint (2.4.g.2) 14 July 2014 [11:33] 14/07/2014 796505094142 796505094142

ALL 59GEW User Entered Faults [3]

ALL User Entered faults, ORDERED by OCCURRENCE DURING 59GEW's MOT HISTORY
ALL 59GEW User Entered Faults [3]
ALL User Entered faults, ORDERED by OCCURRENCE DURING 59GEW's MOT HISTORY
Advisory Faults | source www.vehiclestats.co.uk
Fault Fault Test Date Test Date/Time Reference MOT Test Reference
2 Both rear wheel bearings slightly noisy Both rear wheel bearings slightly noisy 14 July 2014 [16:32] 14/07/2014 14 July 2014 [11:33] 14/07/2014 298275794119 298275794119 796505094142 796505094142
1 Ns/f rack gaitor twisted Ns/f rack gaitor twisted 28 May 2009 [17:26] 28/05/2009 990758949116 990758949116

ALL 59GEW Pass With Rectification Faults [1]

ALL Pass With Rectification faults, ORDERED by OCCURRENCE DURING 59GEW's MOT HISTORY
ALL 59GEW Pass With Rectification Faults [1]
ALL Pass With Rectification faults, ORDERED by OCCURRENCE DURING 59GEW's MOT HISTORY
Pass With Rectification Faults | source www.vehiclestats.co.uk
Fault Fault Test Date Test Date/Time Reference MOT Test Reference
1 Nearside rear brake recording little or no effort (3.7.b.5a) Nearside rear brake recording little or no effort (3.7.b.5a) 07 July 2011 [11:43] 07/07/2011 166148381169 166148381169

MOT TEST: 05 June 2017 13:48:28 PASSED
MOT TEST: 05 June 2017 13:48:28 PASSED

This test (141434064256) was completed on the 05 June 2017 13:48:28 and PASSED the requirements for a valid MOT with 0 comments.

This test (141434064256) was completed on the 05 June 2017 13:48:28 and PASSED the requirements for a valid MOT with 0 comments.

Recorded mileage: 6,873

Recorded mileage: 6,873


MOT TEST: 01 June 2017 13:11:08 FAILED
MOT TEST: 01 June 2017 13:11:08 FAILED

This test (972568289079) was completed on the 01 June 2017 13:11:08 and FAILED the requirements for a valid MOT with 2 comments.

This test (972568289079) was completed on the 01 June 2017 13:11:08 and FAILED the requirements for a valid MOT with 2 comments.

Recorded mileage: 6,871

Recorded mileage: 6,871


FAIL


MOT TEST: 19 August 2015 13:55:34 PASSED
MOT TEST: 19 August 2015 13:55:34 PASSED

This test (885539621441) was completed on the 19 August 2015 13:55:34 and PASSED the requirements for a valid MOT with 0 comments.

This test (885539621441) was completed on the 19 August 2015 13:55:34 and PASSED the requirements for a valid MOT with 0 comments.

Recorded mileage: 6,740

Recorded mileage: 6,740


MOT TEST: 23 July 2015 14:52:13 FAILED
MOT TEST: 23 July 2015 14:52:13 FAILED

This test (335634805425) was completed on the 23 July 2015 14:52:13 and FAILED the requirements for a valid MOT with 7 comments.

This test (335634805425) was completed on the 23 July 2015 14:52:13 and FAILED the requirements for a valid MOT with 7 comments.

Recorded mileage: 6,726

Recorded mileage: 6,726


FAIL


MOT TEST: 14 July 2014 16:32:40 PASSED
MOT TEST: 14 July 2014 16:32:40 PASSED

This test (298275794119) was completed on the 14 July 2014 16:32:40 and PASSED the requirements for a valid MOT with 3 comments.

This test (298275794119) was completed on the 14 July 2014 16:32:40 and PASSED the requirements for a valid MOT with 3 comments.

Recorded mileage: 4,016

Recorded mileage: 4,016


ADVISORY

USER ENTERED


MOT TEST: 14 July 2014 11:33:18 FAILED
MOT TEST: 14 July 2014 11:33:18 FAILED

This test (796505094142) was completed on the 14 July 2014 11:33:18 and FAILED the requirements for a valid MOT with 8 comments.

This test (796505094142) was completed on the 14 July 2014 11:33:18 and FAILED the requirements for a valid MOT with 8 comments.

Recorded mileage: 4,016

Recorded mileage: 4,016


ADVISORY

FAIL

USER ENTERED


MOT TEST: 07 May 2013 16:43:41 PASSED
MOT TEST: 07 May 2013 16:43:41 PASSED

This test (988357723158) was completed on the 07 May 2013 16:43:41 and PASSED the requirements for a valid MOT with 0 comments.

This test (988357723158) was completed on the 07 May 2013 16:43:41 and PASSED the requirements for a valid MOT with 0 comments.

Recorded mileage: 3,655

Recorded mileage: 3,655


MOT TEST: 07 May 2013 15:46:37 FAILED
MOT TEST: 07 May 2013 15:46:37 FAILED

This test (418067223146) was completed on the 07 May 2013 15:46:37 and FAILED the requirements for a valid MOT with 2 comments.

This test (418067223146) was completed on the 07 May 2013 15:46:37 and FAILED the requirements for a valid MOT with 2 comments.

Recorded mileage: 3,655

Recorded mileage: 3,655


FAIL


MOT TEST: 07 July 2011 11:43:03 PASSED
MOT TEST: 07 July 2011 11:43:03 PASSED

This test (176968481190) was completed on the 07 July 2011 11:43:03 and PASSED the requirements for a valid MOT with 0 comments.

This test (176968481190) was completed on the 07 July 2011 11:43:03 and PASSED the requirements for a valid MOT with 0 comments.

Recorded mileage: 2,969

Recorded mileage: 2,969


MOT TEST: 07 July 2011 11:43:03 FAILED
MOT TEST: 07 July 2011 11:43:03 FAILED

This test (166148381169) was completed on the 07 July 2011 11:43:03 and FAILED the requirements for a valid MOT with 1 comments.

This test (166148381169) was completed on the 07 July 2011 11:43:03 and FAILED the requirements for a valid MOT with 1 comments.

Recorded mileage: 2,969

Recorded mileage: 2,969


PASS WITH RECTIFICATION


MOT TEST: 09 June 2010 16:57:51 PASSED
MOT TEST: 09 June 2010 16:57:51 PASSED

This test (270260160442) was completed on the 09 June 2010 16:57:51 and PASSED the requirements for a valid MOT with 0 comments.

This test (270260160442) was completed on the 09 June 2010 16:57:51 and PASSED the requirements for a valid MOT with 0 comments.

Recorded mileage: 2,431

Recorded mileage: 2,431


MOT TEST: 28 May 2009 17:26:49 PASSED
MOT TEST: 28 May 2009 17:26:49 PASSED

This test (990758949116) was completed on the 28 May 2009 17:26:49 and PASSED the requirements for a valid MOT with 1 comments.

This test (990758949116) was completed on the 28 May 2009 17:26:49 and PASSED the requirements for a valid MOT with 1 comments.

Recorded mileage: 723

Recorded mileage: 723


USER ENTERED