604 YUL


604YUL is registered to a White 1962, Morris Minor traveller with a Petrol engine. It Failed its most recent MOT Test on the 14 July 2015

20 unique faults (23 Total) reported in its MOT History (8 Tests).

3 common/recurring faults, the most frequent (2 times) is: Offside Lower Front suspension has slight movement at a suspension ball joint (2.5.A.1c).

50% (4) MOT Pass Rate and a 50% (4) MOT Failure Rate.

89,194 recorded miles.

604 YUL


604YUL is registered to a White 1962, Morris Minor traveller with a Petrol engine. It Failed its most recent MOT Test on the 14 July 2015

20 unique faults (23 Total) reported in its MOT History (8 Tests).

3 common/recurring faults, the most frequent (2 times) is: Offside Lower Front suspension has slight movement at a suspension ball joint (2.5.A.1c).

50% (4) MOT Pass Rate and a 50% (4) MOT Failure Rate.

89,194 recorded miles.

MOT PASS/Failure rate for 604 YUL

all MOT test results for 604 YUL represented as a percentage
MOT PASS/Failure rate for 604 YUL
all MOT test results for 604 YUL represented as a percentage

PERCENTAGE OF VEHICLE FAULTS WITH 604 YUL

ALL REPORTED FAULTS, DISPLAYED BY PERCENTAGE OF OCCURRENCE DURING ALL MOT TESTS
PERCENTAGE OF VEHICLE FAULTS WITH 604 YUL
ALL REPORTED FAULTS, DISPLAYED BY PERCENTAGE OF OCCURRENCE DURING ALL MOT TESTS
ADVISORY

FAIL

USER ENTERED

604 YUL annual Faults by type

ALL REPORTED FAULTS, DISPLAYED over time and categorised by type
604 YUL annual Faults by type
ALL REPORTED FAULTS, DISPLAYED over time and categorised by type

RECURRING FAULTS WITH 604 YUL

FAULTS THAT HAVE OCCURED MORE THAN ONCE DURING 604 YUL's MOT HISTORY
RECURRING FAULTS WITH 604 YUL
FAULTS THAT HAVE OCCURED MORE THAN ONCE DURING 604 YUL's MOT HISTORY
Fault Fault Test Date Test Date/Time Reference MOT Test Reference
2 Offside lower front suspension has slight movement at a suspension ball joint (2.5.a.1c) Offside lower front suspension has slight movement at a suspension ball joint (2.5.a.1c) 14 July 2015 [14:05] 14/07/2015 10 July 2015 [16:17] 10/07/2015 835295295112 835295295112 127141395155 127141395155
2 Front exhaust has a minor leak of exhaust gases (7.1.2) Front exhaust has a minor leak of exhaust gases (7.1.2) 04 April 2013 [15:55] 04/04/2013 25 March 2013 [11:48] 25/03/2013 575004393080 575004393080 188134883060 188134883060
2 Offside rear shock absorber has a light misting of oil (2.7.3) Offside rear shock absorber has a light misting of oil (2.7.3) 19 March 2012 [14:17] 19/03/2012 12 March 2012 [12:51] 12/03/2012 796939072035 796939072035 197752772436 197752772436

ALL 604 YUL ADVISORIES [7]

ALL ADVISORIES, ORDERED by OCCURRENCE DURING 604 YUL's MOT HISTORY
ALL 604 YUL ADVISORIES [7]
ALL ADVISORIES, ORDERED by OCCURRENCE DURING 604 YUL's MOT HISTORY
Advisory Faults | source www.vehiclestats.co.uk
Fault Fault Test Date Test Date/Time Reference MOT Test Reference
2 Offside lower front suspension has slight movement at a suspension ball joint (2.5.a.1c) Offside lower front suspension has slight movement at a suspension ball joint (2.5.a.1c) 14 July 2015 [14:05] 14/07/2015 10 July 2015 [16:17] 10/07/2015 835295295112 835295295112 127141395155 127141395155
2 Front exhaust has a minor leak of exhaust gases (7.1.2) Front exhaust has a minor leak of exhaust gases (7.1.2) 04 April 2013 [15:55] 04/04/2013 25 March 2013 [11:48] 25/03/2013 575004393080 575004393080 188134883060 188134883060
2 Offside rear shock absorber has a light misting of oil (2.7.3) Offside rear shock absorber has a light misting of oil (2.7.3) 19 March 2012 [14:17] 19/03/2012 12 March 2012 [12:51] 12/03/2012 796939072035 796939072035 197752772436 197752772436
1 Offside lower front suspension has slight play in a upper suspension ball joint (2.5.b.1a) Offside lower front suspension has slight play in a upper suspension ball joint (2.5.b.1a) 08 April 2014 [13:59] 08/04/2014 505418894035 505418894035

ALL 604 YUL Failure Faults [14]

ALL Failure faults, ORDERED by OCCURRENCE DURING 604 YUL's MOT HISTORY
ALL 604 YUL Failure Faults [14]
ALL Failure faults, ORDERED by OCCURRENCE DURING 604 YUL's MOT HISTORY
Fail Faults | source www.vehiclestats.co.uk
Fault Fault Test Date Test Date/Time Reference MOT Test Reference
1 Nearside front suspension has excessive play in a upper wishbone bearing (2.5.b.1a) Nearside front suspension has excessive play in a upper wishbone bearing (2.5.b.1a) 10 July 2015 [16:17] 10/07/2015 127141395155 127141395155
1 Horn not working (1.6.2a) Horn not working (1.6.2a) 08 April 2014 [13:59] 08/04/2014 505418894035 505418894035
1 Direction indicators not working (1.4.a.2c) Direction indicators not working (1.4.a.2c) 08 April 2014 [13:59] 08/04/2014 505418894035 505418894035
1 Indicator tell tale inoperative (1.4.a.2a) Indicator tell tale inoperative (1.4.a.2a) 08 April 2014 [13:59] 08/04/2014 505418894035 505418894035
1 Offside front tie bar/rod has excessive play in a pin/bush (2.4.g.2) Offside front tie bar/rod has excessive play in a pin/bush (2.4.g.2) 08 April 2014 [13:59] 08/04/2014 505418894035 505418894035
1 Nearside vehicle structure has excessive corrosion which adversely affects braking or steering (6.1.a.1) Nearside vehicle structure has excessive corrosion which adversely affects braking or steering (6.1.a.1) 08 April 2014 [13:59] 08/04/2014 505418894035 505418894035
1 Nearside front suspension has excessive play in a upper suspension ball joint (2.5.b.1a) Nearside front suspension has excessive play in a upper suspension ball joint (2.5.b.1a) 08 April 2014 [13:59] 08/04/2014 505418894035 505418894035
1 Nearside rear suspension spring mounting prescribed area is excessively corroded (2.4.a.3) Nearside rear suspension spring mounting prescribed area is excessively corroded (2.4.a.3) 25 March 2013 [11:48] 25/03/2013 188134883060 188134883060
1 Offside headlamp aim too low (1.8) Offside headlamp aim too low (1.8) 12 March 2012 [12:51] 12/03/2012 197752772436 197752772436
1 Nearside seat belt anchorage prescribed area is excessively corroded (5.2.6) Nearside seat belt anchorage prescribed area is excessively corroded (5.2.6) 12 March 2012 [12:51] 12/03/2012 197752772436 197752772436
1 Offside rear suspension component mounting prescribed area is excessively corroded (2.4.a.3) Offside rear suspension component mounting prescribed area is excessively corroded (2.4.a.3) 12 March 2012 [12:51] 12/03/2012 197752772436 197752772436
1 Nearside body or chassis has excessive corrosion, seriously affecting its strength within 30cm of the body mountings (6.1.b.2) Nearside body or chassis has excessive corrosion, seriously affecting its strength within 30cm of the body mountings (6.1.b.2) 12 March 2012 [12:51] 12/03/2012 197752772436 197752772436
1 Body has a sharp edge caused by corrosion (6.1.c.1) Body has a sharp edge caused by corrosion (6.1.c.1) 12 March 2012 [12:51] 12/03/2012 197752772436 197752772436
1 Offside body has a sharp edge caused by corrosion (6.1.c.1) Offside body has a sharp edge caused by corrosion (6.1.c.1) 12 March 2012 [12:51] 12/03/2012 197752772436 197752772436

ALL 604 YUL User Entered Faults [2]

ALL User Entered faults, ORDERED by OCCURRENCE DURING 604 YUL's MOT HISTORY
ALL 604 YUL User Entered Faults [2]
ALL User Entered faults, ORDERED by OCCURRENCE DURING 604 YUL's MOT HISTORY
Fail Faults | source www.vehiclestats.co.uk
Fault Fault Test Date Test Date/Time Reference MOT Test Reference
1 All doors stif to open All doors stif to open 08 April 2014 [13:59] 08/04/2014 505418894035 505418894035
1 Both front wheel bearings slightly noisey Both front wheel bearings slightly noisey 08 April 2014 [13:59] 08/04/2014 505418894035 505418894035

MOT TEST: 14 July 2015 14:05:10 PASSED
MOT TEST: 14 July 2015 14:05:10 PASSED

This test (835295295112) was completed on the 14 July 2015 14:05:10 and PASSED the requirements for a valid MOT with 1 comments.

This test (835295295112) was completed on the 14 July 2015 14:05:10 and PASSED the requirements for a valid MOT with 1 comments.

Recorded mileage: 9,740

Recorded mileage: 9,740


ADVISORY


MOT TEST: 10 July 2015 16:17:25 FAILED
MOT TEST: 10 July 2015 16:17:25 FAILED

This test (127141395155) was completed on the 10 July 2015 16:17:25 and FAILED the requirements for a valid MOT with 2 comments.

This test (127141395155) was completed on the 10 July 2015 16:17:25 and FAILED the requirements for a valid MOT with 2 comments.

Recorded mileage: 0

Recorded mileage: 0


ADVISORY

FAIL


MOT TEST: 15 April 2014 15:34:18 PASSED
MOT TEST: 15 April 2014 15:34:18 PASSED

This test (489335004165) was completed on the 15 April 2014 15:34:18 and PASSED the requirements for a valid MOT with 0 comments.

This test (489335004165) was completed on the 15 April 2014 15:34:18 and PASSED the requirements for a valid MOT with 0 comments.

Recorded mileage: 8,919

Recorded mileage: 8,919


MOT TEST: 08 April 2014 13:59:03 FAILED
MOT TEST: 08 April 2014 13:59:03 FAILED

This test (505418894035) was completed on the 08 April 2014 13:59:03 and FAILED the requirements for a valid MOT with 9 comments.

This test (505418894035) was completed on the 08 April 2014 13:59:03 and FAILED the requirements for a valid MOT with 9 comments.

Recorded mileage: 89,194

Recorded mileage: 89,194


ADVISORY

FAIL

USER ENTERED


MOT TEST: 04 April 2013 15:55:50 PASSED
MOT TEST: 04 April 2013 15:55:50 PASSED

This test (575004393080) was completed on the 04 April 2013 15:55:50 and PASSED the requirements for a valid MOT with 1 comments.

This test (575004393080) was completed on the 04 April 2013 15:55:50 and PASSED the requirements for a valid MOT with 1 comments.

Recorded mileage: 7,344

Recorded mileage: 7,344


ADVISORY


MOT TEST: 25 March 2013 11:48:26 FAILED
MOT TEST: 25 March 2013 11:48:26 FAILED

This test (188134883060) was completed on the 25 March 2013 11:48:26 and FAILED the requirements for a valid MOT with 2 comments.

This test (188134883060) was completed on the 25 March 2013 11:48:26 and FAILED the requirements for a valid MOT with 2 comments.

Recorded mileage: 7,342

Recorded mileage: 7,342


ADVISORY

FAIL


MOT TEST: 19 March 2012 14:17:36 PASSED
MOT TEST: 19 March 2012 14:17:36 PASSED

This test (796939072035) was completed on the 19 March 2012 14:17:36 and PASSED the requirements for a valid MOT with 1 comments.

This test (796939072035) was completed on the 19 March 2012 14:17:36 and PASSED the requirements for a valid MOT with 1 comments.

Recorded mileage: 7,271

Recorded mileage: 7,271


ADVISORY


MOT TEST: 12 March 2012 12:51:56 FAILED
MOT TEST: 12 March 2012 12:51:56 FAILED

This test (197752772436) was completed on the 12 March 2012 12:51:56 and FAILED the requirements for a valid MOT with 7 comments.

This test (197752772436) was completed on the 12 March 2012 12:51:56 and FAILED the requirements for a valid MOT with 7 comments.

Recorded mileage: 7,268

Recorded mileage: 7,268


ADVISORY

FAIL