613 BYB


613BYB is registered to a Green 1958, Morris with a Petrol engine. It Failed its most recent MOT Test on the 01 October 2010

7 unique faults (7 Total) reported in its MOT History (6 Tests).

0 common/recurring faults.

67% (4) MOT Pass Rate and a 33% (2) MOT Failure Rate.

19,276 recorded miles.

613 BYB


613BYB is registered to a Green 1958, Morris with a Petrol engine. It Failed its most recent MOT Test on the 01 October 2010

7 unique faults (7 Total) reported in its MOT History (6 Tests).

0 common/recurring faults.

67% (4) MOT Pass Rate and a 33% (2) MOT Failure Rate.

19,276 recorded miles.

MOT PASS/Failure rate for 613 BYB

all MOT test results for 613 BYB represented as a percentage
MOT PASS/Failure rate for 613 BYB
all MOT test results for 613 BYB represented as a percentage

PERCENTAGE OF VEHICLE FAULTS WITH 613 BYB

ALL REPORTED FAULTS, DISPLAYED BY PERCENTAGE OF OCCURRENCE DURING ALL MOT TESTS
PERCENTAGE OF VEHICLE FAULTS WITH 613 BYB
ALL REPORTED FAULTS, DISPLAYED BY PERCENTAGE OF OCCURRENCE DURING ALL MOT TESTS
ADVISORY

FAIL

USER ENTERED

613 BYB annual Faults by type

ALL REPORTED FAULTS, DISPLAYED over time and categorised by type
613 BYB annual Faults by type
ALL REPORTED FAULTS, DISPLAYED over time and categorised by type

ALL 613 BYB ADVISORIES [2]

ALL ADVISORIES, ORDERED by OCCURRENCE DURING 613 BYB's MOT HISTORY
ALL 613 BYB ADVISORIES [2]
ALL ADVISORIES, ORDERED by OCCURRENCE DURING 613 BYB's MOT HISTORY
Fail Faults | source www.vehiclestats.co.uk
Fault Fault Test Date Test Date/Time Reference MOT Test Reference
1 Nearside rear tyre worn close to the legal limit (4.1.e.1) Nearside rear tyre worn close to the legal limit (4.1.e.1) 03 October 2007 [11:32] 03/10/2007 763326177299 763326177299
1 Offside rear tyre worn close to the legal limit (4.1.e.1) Offside rear tyre worn close to the legal limit (4.1.e.1) 03 October 2007 [11:32] 03/10/2007 763326177299 763326177299

ALL 613 BYB Failure Faults [3]

ALL Failure faults, ORDERED by OCCURRENCE DURING 613 BYB's MOT HISTORY
ALL 613 BYB Failure Faults [3]
ALL Failure faults, ORDERED by OCCURRENCE DURING 613 BYB's MOT HISTORY
Fail Faults | source www.vehiclestats.co.uk
Fault Fault Test Date Test Date/Time Reference MOT Test Reference
1 Offside headlamp not working on dipped beam (1.7.5a) Offside headlamp not working on dipped beam (1.7.5a) 03 October 2007 [11:32] 03/10/2007 763326177299 763326177299
1 Offside headlamp not working on main beam (1.7.5a) Offside headlamp not working on main beam (1.7.5a) 03 October 2007 [11:32] 03/10/2007 763326177299 763326177299
1 Offside front lower suspension arm has excessive play in a ball joint (2.4.g.2) Offside front lower suspension arm has excessive play in a ball joint (2.4.g.2) 18 September 2006 [14:29] 18/09/2006 933771466257 933771466257

ALL 613 BYB User Entered Faults [2]

ALL User Entered faults, ORDERED by OCCURRENCE DURING 613 BYB's MOT HISTORY
ALL 613 BYB User Entered Faults [2]
ALL User Entered faults, ORDERED by OCCURRENCE DURING 613 BYB's MOT HISTORY
Fail Faults | source www.vehiclestats.co.uk
Fault Fault Test Date Test Date/Time Reference MOT Test Reference
1 Various patches of corrosion on body small holes Various patches of corrosion on body small holes 03 October 2007 [11:32] 03/10/2007 763326177299 763326177299
1 Corrosion in front panel and surrounding panel †work corrosion in both inner wheel arch areas Corrosion in front panel and surrounding panel †work corrosion in both inner wheel arch areas 18 September 2006 [14:29] 18/09/2006 933771466257 933771466257

MOT TEST: 01 October 2010 11:24:04 PASSED
MOT TEST: 01 October 2010 11:24:04 PASSED

This test (374744870215) was completed on the 01 October 2010 11:24:04 and PASSED the requirements for a valid MOT with 0 comments.

This test (374744870215) was completed on the 01 October 2010 11:24:04 and PASSED the requirements for a valid MOT with 0 comments.

Recorded mileage: 19,276

Recorded mileage: 19,276


MOT TEST: 16 July 2009 12:05:42 PASSED
MOT TEST: 16 July 2009 12:05:42 PASSED

This test (960807499192) was completed on the 16 July 2009 12:05:42 and PASSED the requirements for a valid MOT with 0 comments.

This test (960807499192) was completed on the 16 July 2009 12:05:42 and PASSED the requirements for a valid MOT with 0 comments.

Recorded mileage: 19,253

Recorded mileage: 19,253


MOT TEST: 03 October 2007 13:13:33 PASSED
MOT TEST: 03 October 2007 13:13:33 PASSED

This test (791846777299) was completed on the 03 October 2007 13:13:33 and PASSED the requirements for a valid MOT with 0 comments.

This test (791846777299) was completed on the 03 October 2007 13:13:33 and PASSED the requirements for a valid MOT with 0 comments.

Recorded mileage: 19,204

Recorded mileage: 19,204


MOT TEST: 03 October 2007 11:32:45 FAILED
MOT TEST: 03 October 2007 11:32:45 FAILED

This test (763326177299) was completed on the 03 October 2007 11:32:45 and FAILED the requirements for a valid MOT with 5 comments.

This test (763326177299) was completed on the 03 October 2007 11:32:45 and FAILED the requirements for a valid MOT with 5 comments.

Recorded mileage: 19,204

Recorded mileage: 19,204


ADVISORY

FAIL

USER ENTERED


MOT TEST: 25 September 2006 11:30:36 PASSED
MOT TEST: 25 September 2006 11:30:36 PASSED

This test (103128466294) was completed on the 25 September 2006 11:30:36 and PASSED the requirements for a valid MOT with 0 comments.

This test (103128466294) was completed on the 25 September 2006 11:30:36 and PASSED the requirements for a valid MOT with 0 comments.

Recorded mileage: 19,181

Recorded mileage: 19,181


MOT TEST: 18 September 2006 14:29:58 FAILED
MOT TEST: 18 September 2006 14:29:58 FAILED

This test (933771466257) was completed on the 18 September 2006 14:29:58 and FAILED the requirements for a valid MOT with 2 comments.

This test (933771466257) was completed on the 18 September 2006 14:29:58 and FAILED the requirements for a valid MOT with 2 comments.

Recorded mileage: 19,181

Recorded mileage: 19,181


FAIL

USER ENTERED