614 VMM


614VMM is registered to a Black 1959, Morris Minor with a Petrol engine. It Failed its most recent MOT Test on the 20 September 2017

26 unique faults (29 Total) reported in its MOT History (16 Tests).

3 common/recurring faults, the most frequent (2 times) is: Offside Lower trunnion worn.

62% (10) MOT Pass Rate and a 38% (6) MOT Failure Rate.

36,079 recorded miles.

614 VMM


614VMM is registered to a Black 1959, Morris Minor with a Petrol engine. It Failed its most recent MOT Test on the 20 September 2017

26 unique faults (29 Total) reported in its MOT History (16 Tests).

3 common/recurring faults, the most frequent (2 times) is: Offside Lower trunnion worn.

62% (10) MOT Pass Rate and a 38% (6) MOT Failure Rate.

36,079 recorded miles.

MOT PASS/Failure rate for 614 VMM

all MOT test results for 614 VMM represented as a percentage
MOT PASS/Failure rate for 614 VMM
all MOT test results for 614 VMM represented as a percentage

PERCENTAGE OF VEHICLE FAULTS WITH 614 VMM

ALL REPORTED FAULTS, DISPLAYED BY PERCENTAGE OF OCCURRENCE DURING ALL MOT TESTS
PERCENTAGE OF VEHICLE FAULTS WITH 614 VMM
ALL REPORTED FAULTS, DISPLAYED BY PERCENTAGE OF OCCURRENCE DURING ALL MOT TESTS
ADVISORY

FAIL

USER ENTERED

614 VMM annual Faults by type

ALL REPORTED FAULTS, DISPLAYED over time and categorised by type
614 VMM annual Faults by type
ALL REPORTED FAULTS, DISPLAYED over time and categorised by type

RECURRING FAULTS WITH 614 VMM

FAULTS THAT HAVE OCCURED MORE THAN ONCE DURING 614 VMM's MOT HISTORY
RECURRING FAULTS WITH 614 VMM
FAULTS THAT HAVE OCCURED MORE THAN ONCE DURING 614 VMM's MOT HISTORY
Fault Fault Test Date Test Date/Time Reference MOT Test Reference
2 Offside lower trunnion worn Offside lower trunnion worn 20 September 2017 [15:49] 20/09/2017 19 September 2017 [09:30] 19/09/2017 852001236298 852001236298 742376914584 742376914584
2 Nearside upper trunnion worn Nearside upper trunnion worn 20 September 2017 [15:49] 20/09/2017 19 September 2017 [09:30] 19/09/2017 852001236298 852001236298 742376914584 742376914584
2 Offside front floor corroded Offside front floor corroded 20 September 2013 [12:44] 20/09/2013 19 September 2013 [10:15] 19/09/2013 559263563246 559263563246 269282563214 269282563214

ALL 614 VMM ADVISORIES [9]

ALL ADVISORIES, ORDERED by OCCURRENCE DURING 614 VMM's MOT HISTORY
ALL 614 VMM ADVISORIES [9]
ALL ADVISORIES, ORDERED by OCCURRENCE DURING 614 VMM's MOT HISTORY
Advisory Faults | source www.vehiclestats.co.uk
Fault Fault Test Date Test Date/Time Reference MOT Test Reference
2 Offside lower trunnion worn Offside lower trunnion worn 20 September 2017 [15:49] 20/09/2017 19 September 2017 [09:30] 19/09/2017 852001236298 852001236298 742376914584 742376914584
2 Nearside upper trunnion worn Nearside upper trunnion worn 20 September 2017 [15:49] 20/09/2017 19 September 2017 [09:30] 19/09/2017 852001236298 852001236298 742376914584 742376914584
1 Offside front tyre splitting on edge of tread Offside front tyre splitting on edge of tread 20 September 2016 [12:30] 20/09/2016 270227421496 270227421496
1 Offside front tyre outer sidewall deteriorating Offside front tyre outer sidewall deteriorating 21 September 2015 [11:39] 21/09/2015 725038155778 725038155778
1 Nearside front lower suspension arm rubber bush deteriorated but not resulting in excessive movement inner bush (2.4.g.2) Nearside front lower suspension arm rubber bush deteriorated but not resulting in excessive movement inner bush (2.4.g.2) 21 September 2015 [11:39] 21/09/2015 725038155778 725038155778
1 Offside rear rear position lamp(s) slightly discoloured (1.1.a.3e) Offside rear rear position lamp(s) slightly discoloured (1.1.a.3e) 08 July 2006 [10:33] 08/07/2006 574199786196 574199786196
1 Rear brake hose slightly deteriorated (3.6.b.4d) Rear brake hose slightly deteriorated (3.6.b.4d) 08 July 2006 [10:33] 08/07/2006 574199786196 574199786196

ALL 614 VMM Failure Faults [14]

ALL Failure faults, ORDERED by OCCURRENCE DURING 614 VMM's MOT HISTORY
ALL 614 VMM Failure Faults [14]
ALL Failure faults, ORDERED by OCCURRENCE DURING 614 VMM's MOT HISTORY
Fail Faults | source www.vehiclestats.co.uk
Fault Fault Test Date Test Date/Time Reference MOT Test Reference
1 Horn not working (1.6.2a) Horn not working (1.6.2a) 19 September 2017 [09:30] 19/09/2017 742376914584 742376914584
1 Offside rear brake binding (3.7.b.1) Offside rear brake binding (3.7.b.1) 19 September 2017 [09:30] 19/09/2017 742376914584 742376914584
1 Rear brake application uneven (3.7.b.2) Rear brake application uneven (3.7.b.2) 19 September 2017 [09:30] 19/09/2017 742376914584 742376914584
1 Offside steering rack gaiter split (2.2.d.2d) Offside steering rack gaiter split (2.2.d.2d) 19 September 2013 [10:15] 19/09/2013 269282563214 269282563214
1 Rear brakes release unevenly (3.7.b.4) Rear brakes release unevenly (3.7.b.4) 19 September 2013 [10:15] 19/09/2013 269282563214 269282563214
1 Fuel cap/sealing device sealing washer deteriorated (7.2.4c) Fuel cap/sealing device sealing washer deteriorated (7.2.4c) 08 October 2012 [09:34] 08/10/2012 985102882281 985102882281
1 Front headlamp not working on dipped beam (1.7.5a) Front headlamp not working on dipped beam (1.7.5a) 13 October 2011 [17:34] 13/10/2011 578596781213 578596781213
1 Nearside rear stop lamp not working (1.2.1b) Nearside rear stop lamp not working (1.2.1b) 13 October 2011 [17:34] 13/10/2011 578596781213 578596781213
1 Offside front mechanical brake component has restricted free movement (3.5.1k) Offside front mechanical brake component has restricted free movement (3.5.1k) 13 October 2011 [17:34] 13/10/2011 578596781213 578596781213
1 Fuel cap/sealing device sealing washer missing (7.2.4c) Fuel cap/sealing device sealing washer missing (7.2.4c) 10 July 2008 [12:07] 10/07/2008 824412198153 824412198153
1 Nearside headlamp aim too low (1.8) Nearside headlamp aim too low (1.8) 10 July 2008 [12:07] 10/07/2008 824412198153 824412198153
1 Offside headlamp aim too low (1.8) Offside headlamp aim too low (1.8) 10 July 2008 [12:07] 10/07/2008 824412198153 824412198153
1 Windscreen washer provides insufficient washer liquid (8.2.3) Windscreen washer provides insufficient washer liquid (8.2.3) 08 July 2006 [10:33] 08/07/2006 574199786196 574199786196
1 Offside rear rear brake binding (3.7.b.1) Offside rear rear brake binding (3.7.b.1) 08 July 2006 [10:33] 08/07/2006 574199786196 574199786196

ALL 614 VMM User Entered Faults [6]

ALL User Entered faults, ORDERED by OCCURRENCE DURING 614 VMM's MOT HISTORY
ALL 614 VMM User Entered Faults [6]
ALL User Entered faults, ORDERED by OCCURRENCE DURING 614 VMM's MOT HISTORY
User Entered Faults | source www.vehiclestats.co.uk
Fault Fault Test Date Test Date/Time Reference MOT Test Reference
2 Offside front floor corroded Offside front floor corroded 20 September 2013 [12:44] 20/09/2013 19 September 2013 [10:15] 19/09/2013 559263563246 559263563246 269282563214 269282563214
1 Slight noibe from nearstde front wheel beartng Slight noibe from nearstde front wheel beartng 15 September 2014 [16:26] 15/09/2014 169438054228 169438054228
1 Offside front tyre outer sidewall deteriorating Offside front tyre outer sidewall deteriorating 15 September 2014 [16:26] 15/09/2014 169438054228 169438054228
1 Hole in off side front floor Hole in off side front floor 13 October 2011 [17:34] 13/10/2011 578596781213 578596781213
1 Nearside front lower trunion rubber split Nearside front lower trunion rubber split 08 July 2006 [10:33] 08/07/2006 574199786196 574199786196

MOT TEST: 20 September 2017 15:49:32 PASSED
MOT TEST: 20 September 2017 15:49:32 PASSED

This test (852001236298) was completed on the 20 September 2017 15:49:32 and PASSED the requirements for a valid MOT with 2 comments.

This test (852001236298) was completed on the 20 September 2017 15:49:32 and PASSED the requirements for a valid MOT with 2 comments.

Recorded mileage: 35,688

Recorded mileage: 35,688


ADVISORY


MOT TEST: 19 September 2017 09:30:44 FAILED
MOT TEST: 19 September 2017 09:30:44 FAILED

This test (742376914584) was completed on the 19 September 2017 09:30:44 and FAILED the requirements for a valid MOT with 5 comments.

This test (742376914584) was completed on the 19 September 2017 09:30:44 and FAILED the requirements for a valid MOT with 5 comments.

Recorded mileage: 35,685

Recorded mileage: 35,685


ADVISORY

FAIL


MOT TEST: 20 September 2016 12:30:39 PASSED
MOT TEST: 20 September 2016 12:30:39 PASSED

This test (270227421496) was completed on the 20 September 2016 12:30:39 and PASSED the requirements for a valid MOT with 1 comments.

This test (270227421496) was completed on the 20 September 2016 12:30:39 and PASSED the requirements for a valid MOT with 1 comments.

Recorded mileage: 35,547

Recorded mileage: 35,547


ADVISORY


MOT TEST: 21 September 2015 11:39:18 PASSED
MOT TEST: 21 September 2015 11:39:18 PASSED

This test (725038155778) was completed on the 21 September 2015 11:39:18 and PASSED the requirements for a valid MOT with 2 comments.

This test (725038155778) was completed on the 21 September 2015 11:39:18 and PASSED the requirements for a valid MOT with 2 comments.

Recorded mileage: 35,446

Recorded mileage: 35,446


ADVISORY


MOT TEST: 15 September 2014 16:26:39 PASSED
MOT TEST: 15 September 2014 16:26:39 PASSED

This test (169438054228) was completed on the 15 September 2014 16:26:39 and PASSED the requirements for a valid MOT with 2 comments.

This test (169438054228) was completed on the 15 September 2014 16:26:39 and PASSED the requirements for a valid MOT with 2 comments.

Recorded mileage: 35,307

Recorded mileage: 35,307


USER ENTERED


MOT TEST: 20 September 2013 12:44:39 PASSED
MOT TEST: 20 September 2013 12:44:39 PASSED

This test (559263563246) was completed on the 20 September 2013 12:44:39 and PASSED the requirements for a valid MOT with 1 comments.

This test (559263563246) was completed on the 20 September 2013 12:44:39 and PASSED the requirements for a valid MOT with 1 comments.

Recorded mileage: 36,079

Recorded mileage: 36,079


USER ENTERED


MOT TEST: 19 September 2013 10:15:47 FAILED
MOT TEST: 19 September 2013 10:15:47 FAILED

This test (269282563214) was completed on the 19 September 2013 10:15:47 and FAILED the requirements for a valid MOT with 3 comments.

This test (269282563214) was completed on the 19 September 2013 10:15:47 and FAILED the requirements for a valid MOT with 3 comments.

Recorded mileage: 36,076

Recorded mileage: 36,076


FAIL

USER ENTERED


MOT TEST: 08 October 2012 11:52:12 PASSED
MOT TEST: 08 October 2012 11:52:12 PASSED

This test (386712382264) was completed on the 08 October 2012 11:52:12 and PASSED the requirements for a valid MOT with 0 comments.

This test (386712382264) was completed on the 08 October 2012 11:52:12 and PASSED the requirements for a valid MOT with 0 comments.

Recorded mileage: 35,708

Recorded mileage: 35,708


MOT TEST: 08 October 2012 09:34:19 FAILED
MOT TEST: 08 October 2012 09:34:19 FAILED

This test (985102882281) was completed on the 08 October 2012 09:34:19 and FAILED the requirements for a valid MOT with 1 comments.

This test (985102882281) was completed on the 08 October 2012 09:34:19 and FAILED the requirements for a valid MOT with 1 comments.

Recorded mileage: 35,707

Recorded mileage: 35,707


FAIL


MOT TEST: 14 October 2011 16:23:37 PASSED
MOT TEST: 14 October 2011 16:23:37 PASSED

This test (136667381225) was completed on the 14 October 2011 16:23:37 and PASSED the requirements for a valid MOT with 0 comments.

This test (136667381225) was completed on the 14 October 2011 16:23:37 and PASSED the requirements for a valid MOT with 0 comments.

Recorded mileage: 35,176

Recorded mileage: 35,176


MOT TEST: 13 October 2011 17:34:26 FAILED
MOT TEST: 13 October 2011 17:34:26 FAILED

This test (578596781213) was completed on the 13 October 2011 17:34:26 and FAILED the requirements for a valid MOT with 4 comments.

This test (578596781213) was completed on the 13 October 2011 17:34:26 and FAILED the requirements for a valid MOT with 4 comments.

Recorded mileage: 35,176

Recorded mileage: 35,176


FAIL

USER ENTERED


MOT TEST: 10 July 2008 16:43:06 PASSED
MOT TEST: 10 July 2008 16:43:06 PASSED

This test (803052298115) was completed on the 10 July 2008 16:43:06 and PASSED the requirements for a valid MOT with 0 comments.

This test (803052298115) was completed on the 10 July 2008 16:43:06 and PASSED the requirements for a valid MOT with 0 comments.

Recorded mileage: 35,090

Recorded mileage: 35,090


MOT TEST: 10 July 2008 12:07:57 FAILED
MOT TEST: 10 July 2008 12:07:57 FAILED

This test (824412198153) was completed on the 10 July 2008 12:07:57 and FAILED the requirements for a valid MOT with 3 comments.

This test (824412198153) was completed on the 10 July 2008 12:07:57 and FAILED the requirements for a valid MOT with 3 comments.

Recorded mileage: 35,089

Recorded mileage: 35,089


FAIL


MOT TEST: 05 July 2007 12:43:43 PASSED
MOT TEST: 05 July 2007 12:43:43 PASSED

This test (183946487143) was completed on the 05 July 2007 12:43:43 and PASSED the requirements for a valid MOT with 0 comments.

This test (183946487143) was completed on the 05 July 2007 12:43:43 and PASSED the requirements for a valid MOT with 0 comments.

Recorded mileage: 34,966

Recorded mileage: 34,966


MOT TEST: 10 July 2006 12:38:19 PASSED
MOT TEST: 10 July 2006 12:38:19 PASSED

This test (821151996196) was completed on the 10 July 2006 12:38:19 and PASSED the requirements for a valid MOT with 0 comments.

This test (821151996196) was completed on the 10 July 2006 12:38:19 and PASSED the requirements for a valid MOT with 0 comments.

Recorded mileage: 34,823

Recorded mileage: 34,823


MOT TEST: 08 July 2006 10:33:10 FAILED
MOT TEST: 08 July 2006 10:33:10 FAILED

This test (574199786196) was completed on the 08 July 2006 10:33:10 and FAILED the requirements for a valid MOT with 5 comments.

This test (574199786196) was completed on the 08 July 2006 10:33:10 and FAILED the requirements for a valid MOT with 5 comments.

Recorded mileage: 34,822

Recorded mileage: 34,822


ADVISORY

FAIL

USER ENTERED