614 XUS


614XUS is registered to a Cream 1961, Morris Minor with a Petrol engine. It Failed its most recent MOT Test on the 14 April 2014

10 unique faults (10 Total) reported in its MOT History (3 Tests).

0 common/recurring faults.

67% (2) MOT Pass Rate and a 33% (1) MOT Failure Rate.

44,013 recorded miles.

614 XUS


614XUS is registered to a Cream 1961, Morris Minor with a Petrol engine. It Failed its most recent MOT Test on the 14 April 2014

10 unique faults (10 Total) reported in its MOT History (3 Tests).

0 common/recurring faults.

67% (2) MOT Pass Rate and a 33% (1) MOT Failure Rate.

44,013 recorded miles.

MOT PASS/Failure rate for 614 XUS

all MOT test results for 614 XUS represented as a percentage
MOT PASS/Failure rate for 614 XUS
all MOT test results for 614 XUS represented as a percentage

PERCENTAGE OF VEHICLE FAULTS WITH 614 XUS

ALL REPORTED FAULTS, DISPLAYED BY PERCENTAGE OF OCCURRENCE DURING ALL MOT TESTS
PERCENTAGE OF VEHICLE FAULTS WITH 614 XUS
ALL REPORTED FAULTS, DISPLAYED BY PERCENTAGE OF OCCURRENCE DURING ALL MOT TESTS
ADVISORY

FAIL

USER ENTERED

614 XUS annual Faults by type

ALL REPORTED FAULTS, DISPLAYED over time and categorised by type
614 XUS annual Faults by type
ALL REPORTED FAULTS, DISPLAYED over time and categorised by type

ALL 614 XUS ADVISORIES [2]

ALL ADVISORIES, ORDERED by OCCURRENCE DURING 614 XUS's MOT HISTORY
ALL 614 XUS ADVISORIES [2]
ALL ADVISORIES, ORDERED by OCCURRENCE DURING 614 XUS's MOT HISTORY
Advisory Faults | source www.vehiclestats.co.uk
Fault Fault Test Date Test Date/Time Reference MOT Test Reference
1 Brakes imbalanced requirements only just met. It would appear that the braking system requires adjustment or repair. (3.7.b.5b) Brakes imbalanced requirements only just met. It would appear that the braking system requires adjustment or repair. (3.7.b.5b) 21 February 2013 [14:12] 21/02/2013 418462553039 418462553039
1 Rear exhaust has part of the system slightly deteriorated (7.1.1a) Rear exhaust has part of the system slightly deteriorated (7.1.1a) 01 July 2011 [12:03] 01/07/2011 447472781125 447472781125

ALL 614 XUS Failure Faults [5]

ALL Failure faults, ORDERED by OCCURRENCE DURING 614 XUS's MOT HISTORY
ALL 614 XUS Failure Faults [5]
ALL Failure faults, ORDERED by OCCURRENCE DURING 614 XUS's MOT HISTORY
Fail Faults | source www.vehiclestats.co.uk
Fault Fault Test Date Test Date/Time Reference MOT Test Reference
1 Headlamp not working on main beam (1.7.5a) Headlamp not working on main beam (1.7.5a) 01 July 2011 [12:03] 01/07/2011 447472781125 447472781125
1 Registration plate lamp not working (1.1.c.1d) Registration plate lamp not working (1.1.c.1d) 01 July 2011 [12:03] 01/07/2011 447472781125 447472781125
1 Windscreen washer provides insufficient washer liquid (8.2.3) Windscreen washer provides insufficient washer liquid (8.2.3) 01 July 2011 [12:03] 01/07/2011 447472781125 447472781125
1 Parking brake: efficiency below requirements (3.7.b.7) Parking brake: efficiency below requirements (3.7.b.7) 01 July 2011 [12:03] 01/07/2011 447472781125 447472781125
1 Brakes imbalanced across an axle (3.7.b.5b) Brakes imbalanced across an axle (3.7.b.5b) 01 July 2011 [12:03] 01/07/2011 447472781125 447472781125

ALL 614 XUS User Entered Faults [3]

ALL User Entered faults, ORDERED by OCCURRENCE DURING 614 XUS's MOT HISTORY
ALL 614 XUS User Entered Faults [3]
ALL User Entered faults, ORDERED by OCCURRENCE DURING 614 XUS's MOT HISTORY
Advisory Faults | source www.vehiclestats.co.uk
Fault Fault Test Date Test Date/Time Reference MOT Test Reference
1 All four tyres perished and split on side walls. All four tyres perished and split on side walls. 21 February 2013 [14:12] 21/02/2013 418462553039 418462553039
1 O/s/r inner wheel arch area corroded. O/s/r inner wheel arch area corroded. 21 February 2013 [14:12] 21/02/2013 418462553039 418462553039
1 All 4 tyres perrishing All 4 tyres perrishing 01 July 2011 [12:03] 01/07/2011 447472781125 447472781125

MOT TEST: 14 April 2014 14:05:14 PASSED
MOT TEST: 14 April 2014 14:05:14 PASSED

This test (175294004138) was completed on the 14 April 2014 14:05:14 and PASSED the requirements for a valid MOT with 0 comments.

This test (175294004138) was completed on the 14 April 2014 14:05:14 and PASSED the requirements for a valid MOT with 0 comments.

Recorded mileage: 44,013

Recorded mileage: 44,013


MOT TEST: 21 February 2013 14:12:46 PASSED
MOT TEST: 21 February 2013 14:12:46 PASSED

This test (418462553039) was completed on the 21 February 2013 14:12:46 and PASSED the requirements for a valid MOT with 3 comments.

This test (418462553039) was completed on the 21 February 2013 14:12:46 and PASSED the requirements for a valid MOT with 3 comments.

Recorded mileage: 43,344

Recorded mileage: 43,344


ADVISORY

USER ENTERED


MOT TEST: 01 July 2011 12:03:49 FAILED
MOT TEST: 01 July 2011 12:03:49 FAILED

This test (447472781125) was completed on the 01 July 2011 12:03:49 and FAILED the requirements for a valid MOT with 7 comments.

This test (447472781125) was completed on the 01 July 2011 12:03:49 and FAILED the requirements for a valid MOT with 7 comments.

Recorded mileage: 43,328

Recorded mileage: 43,328


ADVISORY

FAIL

USER ENTERED