616 UXV


616UXV is registered to a Grey 1962, Morris Minor 1000 with a Petrol engine. It Passed its most recent MOT Test on the 13 July 2018

27 unique faults (32 Total) reported in its MOT History (13 Tests).

5 common/recurring faults, the most frequent (2 times) is: Parking brake: efficiency below requirements (3.7.B.7).

77% (10) MOT Pass Rate and a 23% (3) MOT Failure Rate.

95,758 recorded miles.

616 UXV


616UXV is registered to a Grey 1962, Morris Minor 1000 with a Petrol engine. It Passed its most recent MOT Test on the 13 July 2018

27 unique faults (32 Total) reported in its MOT History (13 Tests).

5 common/recurring faults, the most frequent (2 times) is: Parking brake: efficiency below requirements (3.7.B.7).

77% (10) MOT Pass Rate and a 23% (3) MOT Failure Rate.

95,758 recorded miles.

MOT PASS/Failure rate for 616 UXV

all MOT test results for 616 UXV represented as a percentage
MOT PASS/Failure rate for 616 UXV
all MOT test results for 616 UXV represented as a percentage

PERCENTAGE OF VEHICLE FAULTS WITH 616 UXV

ALL REPORTED FAULTS, DISPLAYED BY PERCENTAGE OF OCCURRENCE DURING ALL MOT TESTS
PERCENTAGE OF VEHICLE FAULTS WITH 616 UXV
ALL REPORTED FAULTS, DISPLAYED BY PERCENTAGE OF OCCURRENCE DURING ALL MOT TESTS
ADVISORY

FAIL

USER ENTERED

616 UXV annual Faults by type

ALL REPORTED FAULTS, DISPLAYED over time and categorised by type
616 UXV annual Faults by type
ALL REPORTED FAULTS, DISPLAYED over time and categorised by type

RECURRING FAULTS WITH 616 UXV

FAULTS THAT HAVE OCCURED MORE THAN ONCE DURING 616 UXV's MOT HISTORY
RECURRING FAULTS WITH 616 UXV
FAULTS THAT HAVE OCCURED MORE THAN ONCE DURING 616 UXV's MOT HISTORY
Fault Fault Test Date Test Date/Time Reference MOT Test Reference
2 Parking brake: efficiency below requirements (3.7.b.7) Parking brake: efficiency below requirements (3.7.b.7) 26 June 2014 [12:11] 26/06/2014 26 February 2013 [18:43] 26/02/2013 998137774144 998137774144 128287753414 128287753414
2 Brakes imbalanced across an axle (3.7.b.5b) Brakes imbalanced across an axle (3.7.b.5b) 26 June 2014 [12:11] 26/06/2014 26 February 2013 [18:43] 26/02/2013 998137774144 998137774144 128287753414 128287753414
2 Nearside rear tyre worn close to the legal limit (4.1.e.1) Nearside rear tyre worn close to the legal limit (4.1.e.1) 05 March 2013 [19:56] 05/03/2013 26 February 2013 [18:43] 26/02/2013 806774963000 806774963000 128287753414 128287753414
2 Offside rear tyre worn close to the legal limit (4.1.e.1) Offside rear tyre worn close to the legal limit (4.1.e.1) 05 March 2013 [19:56] 05/03/2013 26 February 2013 [18:43] 26/02/2013 806774963000 806774963000 128287753414 128287753414
2 Front panel corroded Front panel corroded 05 March 2013 [19:56] 05/03/2013 26 February 2013 [18:43] 26/02/2013 806774963000 806774963000 128287753414 128287753414

ALL 616 UXV ADVISORIES [5]

ALL ADVISORIES, ORDERED by OCCURRENCE DURING 616 UXV's MOT HISTORY
ALL 616 UXV ADVISORIES [5]
ALL ADVISORIES, ORDERED by OCCURRENCE DURING 616 UXV's MOT HISTORY
Advisory Faults | source www.vehiclestats.co.uk
Fault Fault Test Date Test Date/Time Reference MOT Test Reference
2 Nearside rear tyre worn close to the legal limit (4.1.e.1) Nearside rear tyre worn close to the legal limit (4.1.e.1) 05 March 2013 [19:56] 05/03/2013 26 February 2013 [18:43] 26/02/2013 806774963000 806774963000 128287753414 128287753414
2 Offside rear tyre worn close to the legal limit (4.1.e.1) Offside rear tyre worn close to the legal limit (4.1.e.1) 05 March 2013 [19:56] 05/03/2013 26 February 2013 [18:43] 26/02/2013 806774963000 806774963000 128287753414 128287753414
1 Service brake: service brake efficiency only just met. It would appear that the braking system requires adjustment or repair. (3.7.b.7) Service brake: service brake efficiency only just met. It would appear that the braking system requires adjustment or repair. (3.7.b.7) 30 January 2009 [15:04] 30/01/2009 702340439097 702340439097

ALL 616 UXV Failure Faults [23]

ALL Failure faults, ORDERED by OCCURRENCE DURING 616 UXV's MOT HISTORY
ALL 616 UXV Failure Faults [23]
ALL Failure faults, ORDERED by OCCURRENCE DURING 616 UXV's MOT HISTORY
Fail Faults | source www.vehiclestats.co.uk
Fault Fault Test Date Test Date/Time Reference MOT Test Reference
2 Parking brake: efficiency below requirements (3.7.b.7) Parking brake: efficiency below requirements (3.7.b.7) 26 June 2014 [12:11] 26/06/2014 26 February 2013 [18:43] 26/02/2013 998137774144 998137774144 128287753414 128287753414
2 Brakes imbalanced across an axle (3.7.b.5b) Brakes imbalanced across an axle (3.7.b.5b) 26 June 2014 [12:11] 26/06/2014 26 February 2013 [18:43] 26/02/2013 998137774144 998137774144 128287753414 128287753414
1 Offside headlamp not working on main beam (1.7.5a) Offside headlamp not working on main beam (1.7.5a) 26 June 2014 [12:11] 26/06/2014 998137774144 998137774144
1 Indicator tell tale inoperative (1.4.a.2a) Indicator tell tale inoperative (1.4.a.2a) 26 June 2014 [12:11] 26/06/2014 998137774144 998137774144
1 Nearside steering rack gaiter insecure (2.2.d.2d) Nearside steering rack gaiter insecure (2.2.d.2d) 26 June 2014 [12:11] 26/06/2014 998137774144 998137774144
1 Offside track rod end ball joint dust cover excessively damaged so that it no longer prevents the ingress of dirt (2.2.c.1c) Offside track rod end ball joint dust cover excessively damaged so that it no longer prevents the ingress of dirt (2.2.c.1c) 26 June 2014 [12:11] 26/06/2014 998137774144 998137774144
1 Nearside rear tyre has a cut in excess of the requirements deep enough to reach the ply or cords (4.1.d.1a) Nearside rear tyre has a cut in excess of the requirements deep enough to reach the ply or cords (4.1.d.1a) 26 June 2014 [12:11] 26/06/2014 998137774144 998137774144
1 Front brakes imbalanced across an axle (3.7.b.5b) Front brakes imbalanced across an axle (3.7.b.5b) 26 June 2014 [12:11] 26/06/2014 998137774144 998137774144
1 Rear brakes imbalanced across an axle (3.7.b.5b) Rear brakes imbalanced across an axle (3.7.b.5b) 26 June 2014 [12:11] 26/06/2014 998137774144 998137774144
1 Nearside rear brake recording little or no effort (3.7.b.5a) Nearside rear brake recording little or no effort (3.7.b.5a) 26 June 2014 [12:11] 26/06/2014 998137774144 998137774144
1 Nearside rear parking brake recording little or no effort (3.7.b.6a) Nearside rear parking brake recording little or no effort (3.7.b.6a) 26 June 2014 [12:11] 26/06/2014 998137774144 998137774144
1 Offside rear parking brake recording little or no effort (3.7.b.6a) Offside rear parking brake recording little or no effort (3.7.b.6a) 26 June 2014 [12:11] 26/06/2014 998137774144 998137774144
1 Service brake: efficiency below requirements (3.7.b.7) Service brake: efficiency below requirements (3.7.b.7) 26 June 2014 [12:11] 26/06/2014 998137774144 998137774144
1 Offside rear stop lamp not working (1.2.1b) Offside rear stop lamp not working (1.2.1b) 26 February 2013 [18:43] 26/02/2013 128287753414 128287753414
1 Offside front suspension component mounting prescribed area is excessively corroded (2.4.a.3) Offside front suspension component mounting prescribed area is excessively corroded (2.4.a.3) 26 February 2013 [18:43] 26/02/2013 128287753414 128287753414
1 Nearside rear rear brake recording little or no effort (3.7.b.5a) Nearside rear rear brake recording little or no effort (3.7.b.5a) 19 October 2006 [11:10] 19/10/2006 100882496288 100882496288
1 Offside rear rear brake recording little or no effort (3.7.b.5a) Offside rear rear brake recording little or no effort (3.7.b.5a) 19 October 2006 [11:10] 19/10/2006 100882496288 100882496288
1 Nearside rear rear parking brake recording little or no effort (3.7.b.6a) Nearside rear rear parking brake recording little or no effort (3.7.b.6a) 19 October 2006 [11:10] 19/10/2006 100882496288 100882496288
1 Horn not working (1.6.2a) Horn not working (1.6.2a) 19 October 2006 [11:10] 19/10/2006 100882496288 100882496288
1 Service brake: efficiency below requirements (3.7.c.1a) Service brake: efficiency below requirements (3.7.c.1a) 19 October 2006 [11:10] 19/10/2006 100882496288 100882496288
1 Parking brake: efficiency below requirements (3.7.c.1b) Parking brake: efficiency below requirements (3.7.c.1b) 19 October 2006 [11:10] 19/10/2006 100882496288 100882496288

ALL 616 UXV User Entered Faults [4]

ALL User Entered faults, ORDERED by OCCURRENCE DURING 616 UXV's MOT HISTORY
ALL 616 UXV User Entered Faults [4]
ALL User Entered faults, ORDERED by OCCURRENCE DURING 616 UXV's MOT HISTORY
Advisory Faults | source www.vehiclestats.co.uk
Fault Fault Test Date Test Date/Time Reference MOT Test Reference
2 Front panel corroded Front panel corroded 05 March 2013 [19:56] 05/03/2013 26 February 2013 [18:43] 26/02/2013 806774963000 806774963000 128287753414 128287753414
1 Front crossmember coroded Front crossmember coroded 17 July 2014 [17:17] 17/07/2014 159668594157 159668594157
1 Front cross member coroded Front cross member coroded 26 June 2014 [12:11] 26/06/2014 998137774144 998137774144

MOT TEST: 13 July 2018 08:12:43 PASSED
MOT TEST: 13 July 2018 08:12:43 PASSED

This test (604993833917) was completed on the 13 July 2018 08:12:43 and PASSED the requirements for a valid MOT with 0 comments.

This test (604993833917) was completed on the 13 July 2018 08:12:43 and PASSED the requirements for a valid MOT with 0 comments.

Recorded mileage: 95,758

Recorded mileage: 95,758


MOT TEST: 01 August 2017 09:37:58 PASSED
MOT TEST: 01 August 2017 09:37:58 PASSED

This test (451995581841) was completed on the 01 August 2017 09:37:58 and PASSED the requirements for a valid MOT with 0 comments.

This test (451995581841) was completed on the 01 August 2017 09:37:58 and PASSED the requirements for a valid MOT with 0 comments.

Recorded mileage: 95,226

Recorded mileage: 95,226


MOT TEST: 17 July 2014 17:17:23 PASSED
MOT TEST: 17 July 2014 17:17:23 PASSED

This test (159668594157) was completed on the 17 July 2014 17:17:23 and PASSED the requirements for a valid MOT with 1 comments.

This test (159668594157) was completed on the 17 July 2014 17:17:23 and PASSED the requirements for a valid MOT with 1 comments.

Recorded mileage: 95,116

Recorded mileage: 95,116


USER ENTERED


MOT TEST: 26 June 2014 12:11:55 FAILED
MOT TEST: 26 June 2014 12:11:55 FAILED

This test (998137774144) was completed on the 26 June 2014 12:11:55 and FAILED the requirements for a valid MOT with 14 comments.

This test (998137774144) was completed on the 26 June 2014 12:11:55 and FAILED the requirements for a valid MOT with 14 comments.

Recorded mileage: 95,106

Recorded mileage: 95,106


FAIL

USER ENTERED


MOT TEST: 05 March 2013 19:56:48 PASSED
MOT TEST: 05 March 2013 19:56:48 PASSED

This test (806774963000) was completed on the 05 March 2013 19:56:48 and PASSED the requirements for a valid MOT with 3 comments.

This test (806774963000) was completed on the 05 March 2013 19:56:48 and PASSED the requirements for a valid MOT with 3 comments.

Recorded mileage: 94,614

Recorded mileage: 94,614


ADVISORY

USER ENTERED


MOT TEST: 26 February 2013 18:43:46 FAILED
MOT TEST: 26 February 2013 18:43:46 FAILED

This test (128287753414) was completed on the 26 February 2013 18:43:46 and FAILED the requirements for a valid MOT with 7 comments.

This test (128287753414) was completed on the 26 February 2013 18:43:46 and FAILED the requirements for a valid MOT with 7 comments.

Recorded mileage: 94,611

Recorded mileage: 94,611


ADVISORY

FAIL

USER ENTERED


MOT TEST: 25 January 2012 10:27:18 PASSED
MOT TEST: 25 January 2012 10:27:18 PASSED

This test (999655122006) was completed on the 25 January 2012 10:27:18 and PASSED the requirements for a valid MOT with 0 comments.

This test (999655122006) was completed on the 25 January 2012 10:27:18 and PASSED the requirements for a valid MOT with 0 comments.

Recorded mileage: 92,109

Recorded mileage: 92,109


MOT TEST: 08 March 2011 08:27:32 PASSED
MOT TEST: 08 March 2011 08:27:32 PASSED

This test (709077461045) was completed on the 08 March 2011 08:27:32 and PASSED the requirements for a valid MOT with 0 comments.

This test (709077461045) was completed on the 08 March 2011 08:27:32 and PASSED the requirements for a valid MOT with 0 comments.

Recorded mileage: 89,662

Recorded mileage: 89,662


MOT TEST: 06 March 2010 08:57:41 PASSED
MOT TEST: 06 March 2010 08:57:41 PASSED

This test (443465760014) was completed on the 06 March 2010 08:57:41 and PASSED the requirements for a valid MOT with 0 comments.

This test (443465760014) was completed on the 06 March 2010 08:57:41 and PASSED the requirements for a valid MOT with 0 comments.

Recorded mileage: 86,864

Recorded mileage: 86,864


MOT TEST: 30 January 2009 15:04:36 PASSED
MOT TEST: 30 January 2009 15:04:36 PASSED

This test (702340439097) was completed on the 30 January 2009 15:04:36 and PASSED the requirements for a valid MOT with 1 comments.

This test (702340439097) was completed on the 30 January 2009 15:04:36 and PASSED the requirements for a valid MOT with 1 comments.

Recorded mileage: 86,728

Recorded mileage: 86,728


ADVISORY


MOT TEST: 25 January 2008 11:47:20 PASSED
MOT TEST: 25 January 2008 11:47:20 PASSED

This test (152635028091) was completed on the 25 January 2008 11:47:20 and PASSED the requirements for a valid MOT with 0 comments.

This test (152635028091) was completed on the 25 January 2008 11:47:20 and PASSED the requirements for a valid MOT with 0 comments.

Recorded mileage: 82,033

Recorded mileage: 82,033


MOT TEST: 24 October 2006 13:41:13 PASSED
MOT TEST: 24 October 2006 13:41:13 PASSED

This test (500327896257) was completed on the 24 October 2006 13:41:13 and PASSED the requirements for a valid MOT with 0 comments.

This test (500327896257) was completed on the 24 October 2006 13:41:13 and PASSED the requirements for a valid MOT with 0 comments.

Recorded mileage: 76,763

Recorded mileage: 76,763


MOT TEST: 19 October 2006 11:10:13 FAILED
MOT TEST: 19 October 2006 11:10:13 FAILED

This test (100882496288) was completed on the 19 October 2006 11:10:13 and FAILED the requirements for a valid MOT with 6 comments.

This test (100882496288) was completed on the 19 October 2006 11:10:13 and FAILED the requirements for a valid MOT with 6 comments.

Recorded mileage: 76,699

Recorded mileage: 76,699


FAIL