622 DPL


622DPL is registered to a Green 1957, Morris Minor with a Petrol engine. It Failed its most recent MOT Test on the 11 April 2012

6 unique faults (6 Total) reported in its MOT History (9 Tests).

0 common/recurring faults.

78% (7) MOT Pass Rate and a 22% (2) MOT Failure Rate.

80,127 recorded miles.

622 DPL


622DPL is registered to a Green 1957, Morris Minor with a Petrol engine. It Failed its most recent MOT Test on the 11 April 2012

6 unique faults (6 Total) reported in its MOT History (9 Tests).

0 common/recurring faults.

78% (7) MOT Pass Rate and a 22% (2) MOT Failure Rate.

80,127 recorded miles.

MOT PASS/Failure rate for 622 DPL

all MOT test results for 622 DPL represented as a percentage
MOT PASS/Failure rate for 622 DPL
all MOT test results for 622 DPL represented as a percentage

PERCENTAGE OF VEHICLE FAULTS WITH 622 DPL

ALL REPORTED FAULTS, DISPLAYED BY PERCENTAGE OF OCCURRENCE DURING ALL MOT TESTS
PERCENTAGE OF VEHICLE FAULTS WITH 622 DPL
ALL REPORTED FAULTS, DISPLAYED BY PERCENTAGE OF OCCURRENCE DURING ALL MOT TESTS
PASS WITH RECTIFICATION

622 DPL annual Faults by type

ALL REPORTED FAULTS, DISPLAYED over time and categorised by type
622 DPL annual Faults by type
ALL REPORTED FAULTS, DISPLAYED over time and categorised by type

ALL 622 DPL Pass With Rectification Faults [6]

ALL Pass With Rectification faults, ORDERED by OCCURRENCE DURING 622 DPL's MOT HISTORY
ALL 622 DPL Pass With Rectification Faults [6]
ALL Pass With Rectification faults, ORDERED by OCCURRENCE DURING 622 DPL's MOT HISTORY
Pass With Rectification Faults | source www.vehiclestats.co.uk
Fault Fault Test Date Test Date/Time Reference MOT Test Reference
1 Nearside semaphore indicator arm does not extend smoothly (1.4.c.1a) Nearside semaphore indicator arm does not extend smoothly (1.4.c.1a) 17 April 2009 [18:01] 17/04/2009 572967709143 572967709143
1 Nearside semaphore indicator arm arm does not show an amber light to the front (1.4.c.1b) Nearside semaphore indicator arm arm does not show an amber light to the front (1.4.c.1b) 17 April 2009 [18:01] 17/04/2009 572967709143 572967709143
1 Nearside semaphore indicator arm arm does not show an amber light to the rear (1.4.c.1b) Nearside semaphore indicator arm arm does not show an amber light to the rear (1.4.c.1b) 17 April 2009 [18:01] 17/04/2009 572967709143 572967709143
1 Rear registration plate lamp not working (1.1.5c) Rear registration plate lamp not working (1.1.5c) 30 June 2008 [16:13] 30/06/2008 940872188126 940872188126
1 Nearside rear parking brake recording little or no effort (3.7.b.6a) Nearside rear parking brake recording little or no effort (3.7.b.6a) 30 June 2008 [16:13] 30/06/2008 940872188126 940872188126
1 Centre exhaust system not adequately supported (7.1.1) Centre exhaust system not adequately supported (7.1.1) 30 June 2008 [16:13] 30/06/2008 940872188126 940872188126

MOT TEST: 11 April 2012 10:28:37 PASSED
MOT TEST: 11 April 2012 10:28:37 PASSED

This test (826062702164) was completed on the 11 April 2012 10:28:37 and PASSED the requirements for a valid MOT with 0 comments.

This test (826062702164) was completed on the 11 April 2012 10:28:37 and PASSED the requirements for a valid MOT with 0 comments.

Recorded mileage: 80,127

Recorded mileage: 80,127


MOT TEST: 06 April 2011 10:31:42 PASSED
MOT TEST: 06 April 2011 10:31:42 PASSED

This test (829386891080) was completed on the 06 April 2011 10:31:42 and PASSED the requirements for a valid MOT with 0 comments.

This test (829386891080) was completed on the 06 April 2011 10:31:42 and PASSED the requirements for a valid MOT with 0 comments.

Recorded mileage: 79,559

Recorded mileage: 79,559


MOT TEST: 19 April 2010 10:11:05 PASSED
MOT TEST: 19 April 2010 10:11:05 PASSED

This test (770336900119) was completed on the 19 April 2010 10:11:05 and PASSED the requirements for a valid MOT with 0 comments.

This test (770336900119) was completed on the 19 April 2010 10:11:05 and PASSED the requirements for a valid MOT with 0 comments.

Recorded mileage: 79,085

Recorded mileage: 79,085


MOT TEST: 17 April 2009 18:01:25 PASSED
MOT TEST: 17 April 2009 18:01:25 PASSED

This test (842887809183) was completed on the 17 April 2009 18:01:25 and PASSED the requirements for a valid MOT with 0 comments.

This test (842887809183) was completed on the 17 April 2009 18:01:25 and PASSED the requirements for a valid MOT with 0 comments.

Recorded mileage: 78,451

Recorded mileage: 78,451


MOT TEST: 17 April 2009 18:01:25 FAILED
MOT TEST: 17 April 2009 18:01:25 FAILED

This test (572967709143) was completed on the 17 April 2009 18:01:25 and FAILED the requirements for a valid MOT with 3 comments.

This test (572967709143) was completed on the 17 April 2009 18:01:25 and FAILED the requirements for a valid MOT with 3 comments.

Recorded mileage: 78,451

Recorded mileage: 78,451


PASS WITH RECTIFICATION


MOT TEST: 30 June 2008 16:13:50 PASSED
MOT TEST: 30 June 2008 16:13:50 PASSED

This test (612592188178) was completed on the 30 June 2008 16:13:50 and PASSED the requirements for a valid MOT with 0 comments.

This test (612592188178) was completed on the 30 June 2008 16:13:50 and PASSED the requirements for a valid MOT with 0 comments.

Recorded mileage: 77,982

Recorded mileage: 77,982


MOT TEST: 30 June 2008 16:13:50 FAILED
MOT TEST: 30 June 2008 16:13:50 FAILED

This test (940872188126) was completed on the 30 June 2008 16:13:50 and FAILED the requirements for a valid MOT with 3 comments.

This test (940872188126) was completed on the 30 June 2008 16:13:50 and FAILED the requirements for a valid MOT with 3 comments.

Recorded mileage: 77,982

Recorded mileage: 77,982


PASS WITH RECTIFICATION


MOT TEST: 06 July 2007 17:57:54 PASSED
MOT TEST: 06 July 2007 17:57:54 PASSED

This test (582707787191) was completed on the 06 July 2007 17:57:54 and PASSED the requirements for a valid MOT with 0 comments.

This test (582707787191) was completed on the 06 July 2007 17:57:54 and PASSED the requirements for a valid MOT with 0 comments.

Recorded mileage: 77,332

Recorded mileage: 77,332


MOT TEST: 27 June 2006 11:17:59 PASSED
MOT TEST: 27 June 2006 11:17:59 PASSED

This test (241168976110) was completed on the 27 June 2006 11:17:59 and PASSED the requirements for a valid MOT with 0 comments.

This test (241168976110) was completed on the 27 June 2006 11:17:59 and PASSED the requirements for a valid MOT with 0 comments.

Recorded mileage: 76,533

Recorded mileage: 76,533