623 HPL


623HPL is registered to a Blue 1959, Morris Minor 1000 with a Petrol engine. It Failed its most recent MOT Test on the 02 May 2017

14 unique faults (14 Total) reported in its MOT History (11 Tests).

0 common/recurring faults.

73% (8) MOT Pass Rate and a 27% (3) MOT Failure Rate.

11,472 recorded miles.

623 HPL


623HPL is registered to a Blue 1959, Morris Minor 1000 with a Petrol engine. It Failed its most recent MOT Test on the 02 May 2017

14 unique faults (14 Total) reported in its MOT History (11 Tests).

0 common/recurring faults.

73% (8) MOT Pass Rate and a 27% (3) MOT Failure Rate.

11,472 recorded miles.

MOT PASS/Failure rate for 623 HPL

all MOT test results for 623 HPL represented as a percentage
MOT PASS/Failure rate for 623 HPL
all MOT test results for 623 HPL represented as a percentage

PERCENTAGE OF VEHICLE FAULTS WITH 623 HPL

ALL REPORTED FAULTS, DISPLAYED BY PERCENTAGE OF OCCURRENCE DURING ALL MOT TESTS
PERCENTAGE OF VEHICLE FAULTS WITH 623 HPL
ALL REPORTED FAULTS, DISPLAYED BY PERCENTAGE OF OCCURRENCE DURING ALL MOT TESTS
ADVISORY

FAIL

623 HPL annual Faults by type

ALL REPORTED FAULTS, DISPLAYED over time and categorised by type
623 HPL annual Faults by type
ALL REPORTED FAULTS, DISPLAYED over time and categorised by type

ALL 623 HPL ADVISORIES [2]

ALL ADVISORIES, ORDERED by OCCURRENCE DURING 623 HPL's MOT HISTORY
ALL 623 HPL ADVISORIES [2]
ALL ADVISORIES, ORDERED by OCCURRENCE DURING 623 HPL's MOT HISTORY
Advisory Faults | source www.vehiclestats.co.uk
Fault Fault Test Date Test Date/Time Reference MOT Test Reference
1 Nearside front lower front suspension has slight play in a lower suspension ball joint (2.5.b.1a) Nearside front lower front suspension has slight play in a lower suspension ball joint (2.5.b.1a) 20 June 2011 [16:21] 20/06/2011 425571871172 425571871172
1 Offside front lower front suspension has slight play in a lower suspension ball joint (2.5.b.1a) Offside front lower front suspension has slight play in a lower suspension ball joint (2.5.b.1a) 20 June 2011 [16:21] 20/06/2011 425571871172 425571871172

ALL 623 HPL Failure Faults [12]

ALL Failure faults, ORDERED by OCCURRENCE DURING 623 HPL's MOT HISTORY
ALL 623 HPL Failure Faults [12]
ALL Failure faults, ORDERED by OCCURRENCE DURING 623 HPL's MOT HISTORY
Fail Faults | source www.vehiclestats.co.uk
Fault Fault Test Date Test Date/Time Reference MOT Test Reference
1 All position lamps not working (1.1.a.3b) All position lamps not working (1.1.a.3b) 13 July 2015 [15:01] 13/07/2015 397024595170 397024595170
1 Nearside rear leaf spring to axle securing nut insecure (2.4.b.7b) Nearside rear leaf spring to axle securing nut insecure (2.4.b.7b) 13 July 2015 [15:01] 13/07/2015 397024595170 397024595170
1 Nearside front shock absorber has a serious fluid leak (2.7.3) Nearside front shock absorber has a serious fluid leak (2.7.3) 13 July 2015 [15:01] 13/07/2015 397024595170 397024595170
1 Nearside front brake binding (3.7.b.1) Nearside front brake binding (3.7.b.1) 13 July 2015 [15:01] 13/07/2015 397024595170 397024595170
1 Offside front brake binding (3.7.b.1) Offside front brake binding (3.7.b.1) 13 July 2015 [15:01] 13/07/2015 397024595170 397024595170
1 Nearside rear brake binding (3.7.b.1) Nearside rear brake binding (3.7.b.1) 13 July 2015 [15:01] 13/07/2015 397024595170 397024595170
1 Offside rear brake binding (3.7.b.1) Offside rear brake binding (3.7.b.1) 13 July 2015 [15:01] 13/07/2015 397024595170 397024595170
1 Front brakes imbalanced across an axle (3.7.b.5b) Front brakes imbalanced across an axle (3.7.b.5b) 13 July 2015 [15:01] 13/07/2015 397024595170 397024595170
1 Service brake: efficiency below requirements (3.7.b.7) Service brake: efficiency below requirements (3.7.b.7) 13 July 2015 [15:01] 13/07/2015 397024595170 397024595170
1 Nearside headlamp not working on main beam (1.7.5a) Nearside headlamp not working on main beam (1.7.5a) 03 June 2009 [16:06] 03/06/2009 184304959188 184304959188
1 Nearside stop lamp not working (1.2.1b) Nearside stop lamp not working (1.2.1b) 12 July 2007 [11:06] 12/07/2007 484533997178 484533997178
1 Offside stop lamp not working (1.2.1b) Offside stop lamp not working (1.2.1b) 12 July 2007 [11:06] 12/07/2007 484533997178 484533997178

MOT TEST: 02 May 2017 09:45:51 PASSED
MOT TEST: 02 May 2017 09:45:51 PASSED

This test (631906193073) was completed on the 02 May 2017 09:45:51 and PASSED the requirements for a valid MOT with 0 comments.

This test (631906193073) was completed on the 02 May 2017 09:45:51 and PASSED the requirements for a valid MOT with 0 comments.

Recorded mileage: 11,472

Recorded mileage: 11,472


MOT TEST: 21 July 2015 15:37:07 PASSED
MOT TEST: 21 July 2015 15:37:07 PASSED

This test (536572905271) was completed on the 21 July 2015 15:37:07 and PASSED the requirements for a valid MOT with 0 comments.

This test (536572905271) was completed on the 21 July 2015 15:37:07 and PASSED the requirements for a valid MOT with 0 comments.

Recorded mileage: 11,324

Recorded mileage: 11,324


MOT TEST: 13 July 2015 15:01:46 FAILED
MOT TEST: 13 July 2015 15:01:46 FAILED

This test (397024595170) was completed on the 13 July 2015 15:01:46 and FAILED the requirements for a valid MOT with 9 comments.

This test (397024595170) was completed on the 13 July 2015 15:01:46 and FAILED the requirements for a valid MOT with 9 comments.

Recorded mileage: 11,322

Recorded mileage: 11,322


FAIL


MOT TEST: 19 June 2012 10:21:06 PASSED
MOT TEST: 19 June 2012 10:21:06 PASSED

This test (206561272425) was completed on the 19 June 2012 10:21:06 and PASSED the requirements for a valid MOT with 0 comments.

This test (206561272425) was completed on the 19 June 2012 10:21:06 and PASSED the requirements for a valid MOT with 0 comments.

Recorded mileage: 11,147

Recorded mileage: 11,147


MOT TEST: 20 June 2011 16:21:13 PASSED
MOT TEST: 20 June 2011 16:21:13 PASSED

This test (425571871172) was completed on the 20 June 2011 16:21:13 and PASSED the requirements for a valid MOT with 2 comments.

This test (425571871172) was completed on the 20 June 2011 16:21:13 and PASSED the requirements for a valid MOT with 2 comments.

Recorded mileage: 11,024

Recorded mileage: 11,024


ADVISORY


MOT TEST: 24 June 2010 11:49:13 PASSED
MOT TEST: 24 June 2010 11:49:13 PASSED

This test (240945470157) was completed on the 24 June 2010 11:49:13 and PASSED the requirements for a valid MOT with 0 comments.

This test (240945470157) was completed on the 24 June 2010 11:49:13 and PASSED the requirements for a valid MOT with 0 comments.

Recorded mileage: 10,912

Recorded mileage: 10,912


MOT TEST: 03 June 2009 16:51:43 PASSED
MOT TEST: 03 June 2009 16:51:43 PASSED

This test (141604759148) was completed on the 03 June 2009 16:51:43 and PASSED the requirements for a valid MOT with 0 comments.

This test (141604759148) was completed on the 03 June 2009 16:51:43 and PASSED the requirements for a valid MOT with 0 comments.

Recorded mileage: 10,741

Recorded mileage: 10,741


MOT TEST: 03 June 2009 16:06:52 FAILED
MOT TEST: 03 June 2009 16:06:52 FAILED

This test (184304959188) was completed on the 03 June 2009 16:06:52 and FAILED the requirements for a valid MOT with 1 comments.

This test (184304959188) was completed on the 03 June 2009 16:06:52 and FAILED the requirements for a valid MOT with 1 comments.

Recorded mileage: 10,741

Recorded mileage: 10,741


FAIL


MOT TEST: 13 July 2007 11:54:52 PASSED
MOT TEST: 13 July 2007 11:54:52 PASSED

This test (624024597111) was completed on the 13 July 2007 11:54:52 and PASSED the requirements for a valid MOT with 0 comments.

This test (624024597111) was completed on the 13 July 2007 11:54:52 and PASSED the requirements for a valid MOT with 0 comments.

Recorded mileage: 10,418

Recorded mileage: 10,418


MOT TEST: 12 July 2007 11:06:11 FAILED
MOT TEST: 12 July 2007 11:06:11 FAILED

This test (484533997178) was completed on the 12 July 2007 11:06:11 and FAILED the requirements for a valid MOT with 2 comments.

This test (484533997178) was completed on the 12 July 2007 11:06:11 and FAILED the requirements for a valid MOT with 2 comments.

Recorded mileage: 10,418

Recorded mileage: 10,418


FAIL


MOT TEST: 13 May 2005 14:47:27 PASSED
MOT TEST: 13 May 2005 14:47:27 PASSED

This test (250043035176) was completed on the 13 May 2005 14:47:27 and PASSED the requirements for a valid MOT with 0 comments.

This test (250043035176) was completed on the 13 May 2005 14:47:27 and PASSED the requirements for a valid MOT with 0 comments.

Recorded mileage: 10,156

Recorded mileage: 10,156