623 XUA


623XUA is registered to a Blue 1960, Morris Minor with a Petrol engine. It Failed its most recent MOT Test on the 27 January 2009

12 unique faults (12 Total) reported in its MOT History (5 Tests).

0 common/recurring faults.

60% (3) MOT Pass Rate and a 40% (2) MOT Failure Rate.

73,335 recorded miles.

623 XUA


623XUA is registered to a Blue 1960, Morris Minor with a Petrol engine. It Failed its most recent MOT Test on the 27 January 2009

12 unique faults (12 Total) reported in its MOT History (5 Tests).

0 common/recurring faults.

60% (3) MOT Pass Rate and a 40% (2) MOT Failure Rate.

73,335 recorded miles.

MOT PASS/Failure rate for 623 XUA

all MOT test results for 623 XUA represented as a percentage
MOT PASS/Failure rate for 623 XUA
all MOT test results for 623 XUA represented as a percentage

PERCENTAGE OF VEHICLE FAULTS WITH 623 XUA

ALL REPORTED FAULTS, DISPLAYED BY PERCENTAGE OF OCCURRENCE DURING ALL MOT TESTS
PERCENTAGE OF VEHICLE FAULTS WITH 623 XUA
ALL REPORTED FAULTS, DISPLAYED BY PERCENTAGE OF OCCURRENCE DURING ALL MOT TESTS
FAIL

623 XUA annual Faults by type

ALL REPORTED FAULTS, DISPLAYED over time and categorised by type
623 XUA annual Faults by type
ALL REPORTED FAULTS, DISPLAYED over time and categorised by type

ALL 623 XUA Failure Faults [12]

ALL Failure faults, ORDERED by OCCURRENCE DURING 623 XUA's MOT HISTORY
ALL 623 XUA Failure Faults [12]
ALL Failure faults, ORDERED by OCCURRENCE DURING 623 XUA's MOT HISTORY
Fail Faults | source www.vehiclestats.co.uk
Fault Fault Test Date Test Date/Time Reference MOT Test Reference
1 Nearside front suspension has excessive play in a upper suspension ball joint (2.5.b.1a) Nearside front suspension has excessive play in a upper suspension ball joint (2.5.b.1a) 14 January 2009 [13:43] 14/01/2009 620214219047 620214219047
1 Nearside front suspension has excessive play in a lower suspension ball joint (2.5.b.1a) Nearside front suspension has excessive play in a lower suspension ball joint (2.5.b.1a) 14 January 2009 [13:43] 14/01/2009 620214219047 620214219047
1 Nearside front brake recording little or no effort (3.7.b.5a) Nearside front brake recording little or no effort (3.7.b.5a) 14 January 2009 [13:43] 14/01/2009 620214219047 620214219047
1 Offside front brake recording little or no effort (3.7.b.5a) Offside front brake recording little or no effort (3.7.b.5a) 14 January 2009 [13:43] 14/01/2009 620214219047 620214219047
1 Service brake: efficiency below requirements (3.7.b.7) Service brake: efficiency below requirements (3.7.b.7) 14 January 2009 [13:43] 14/01/2009 620214219047 620214219047
1 Brakes imbalanced across an axle (3.7.b.5b) Brakes imbalanced across an axle (3.7.b.5b) 14 January 2009 [13:43] 14/01/2009 620214219047 620214219047
1 Offside steering rack gaiter split (2.2.d.2d) Offside steering rack gaiter split (2.2.d.2d) 08 August 2007 [08:47] 08/08/2007 881530127270 881530127270
1 Offside front position lamp(s) not working (1.1.a.3b) Offside front position lamp(s) not working (1.1.a.3b) 08 August 2007 [08:47] 08/08/2007 881530127270 881530127270
1 Nearside rear brake recording little or no effort (3.7.b.5a) Nearside rear brake recording little or no effort (3.7.b.5a) 08 August 2007 [08:47] 08/08/2007 881530127270 881530127270
1 Nearside rear parking brake recording little or no effort (3.7.b.6a) Nearside rear parking brake recording little or no effort (3.7.b.6a) 08 August 2007 [08:47] 08/08/2007 881530127270 881530127270
1 Offside front suspension arm has excessive play in a pin/bush (2.4.g.2) Offside front suspension arm has excessive play in a pin/bush (2.4.g.2) 08 August 2007 [08:47] 08/08/2007 881530127270 881530127270
1 Parking brake: efficiency below requirements (3.7.b.7) Parking brake: efficiency below requirements (3.7.b.7) 08 August 2007 [08:47] 08/08/2007 881530127270 881530127270

MOT TEST: 27 January 2009 17:15:35 PASSED
MOT TEST: 27 January 2009 17:15:35 PASSED

This test (662837129022) was completed on the 27 January 2009 17:15:35 and PASSED the requirements for a valid MOT with 0 comments.

This test (662837129022) was completed on the 27 January 2009 17:15:35 and PASSED the requirements for a valid MOT with 0 comments.

Recorded mileage: 73,335

Recorded mileage: 73,335


MOT TEST: 14 January 2009 13:43:13 FAILED
MOT TEST: 14 January 2009 13:43:13 FAILED

This test (620214219047) was completed on the 14 January 2009 13:43:13 and FAILED the requirements for a valid MOT with 6 comments.

This test (620214219047) was completed on the 14 January 2009 13:43:13 and FAILED the requirements for a valid MOT with 6 comments.

Recorded mileage: 73,320

Recorded mileage: 73,320


FAIL


MOT TEST: 14 August 2007 08:56:48 PASSED
MOT TEST: 14 August 2007 08:56:48 PASSED

This test (991346827203) was completed on the 14 August 2007 08:56:48 and PASSED the requirements for a valid MOT with 0 comments.

This test (991346827203) was completed on the 14 August 2007 08:56:48 and PASSED the requirements for a valid MOT with 0 comments.

Recorded mileage: 62,940

Recorded mileage: 62,940


MOT TEST: 08 August 2007 08:47:07 FAILED
MOT TEST: 08 August 2007 08:47:07 FAILED

This test (881530127270) was completed on the 08 August 2007 08:47:07 and FAILED the requirements for a valid MOT with 6 comments.

This test (881530127270) was completed on the 08 August 2007 08:47:07 and FAILED the requirements for a valid MOT with 6 comments.

Recorded mileage: 62,940

Recorded mileage: 62,940


FAIL


MOT TEST: 29 July 2006 11:20:05 PASSED
MOT TEST: 29 July 2006 11:20:05 PASSED

This test (990060116208) was completed on the 29 July 2006 11:20:05 and PASSED the requirements for a valid MOT with 0 comments.

This test (990060116208) was completed on the 29 July 2006 11:20:05 and PASSED the requirements for a valid MOT with 0 comments.

Recorded mileage: 61,971

Recorded mileage: 61,971