625 UXD


625UXD is registered to a Black 1955, Morris Minor with a Petrol engine. It Failed its most recent MOT Test on the 29 May 2009

4 unique faults (4 Total) reported in its MOT History (4 Tests).

0 common/recurring faults.

75% (3) MOT Pass Rate and a 25% (1) MOT Failure Rate.

46,875 recorded miles.

625 UXD


625UXD is registered to a Black 1955, Morris Minor with a Petrol engine. It Failed its most recent MOT Test on the 29 May 2009

4 unique faults (4 Total) reported in its MOT History (4 Tests).

0 common/recurring faults.

75% (3) MOT Pass Rate and a 25% (1) MOT Failure Rate.

46,875 recorded miles.

MOT PASS/Failure rate for 625 UXD

all MOT test results for 625 UXD represented as a percentage
MOT PASS/Failure rate for 625 UXD
all MOT test results for 625 UXD represented as a percentage

PERCENTAGE OF VEHICLE FAULTS WITH 625 UXD

ALL REPORTED FAULTS, DISPLAYED BY PERCENTAGE OF OCCURRENCE DURING ALL MOT TESTS
PERCENTAGE OF VEHICLE FAULTS WITH 625 UXD
ALL REPORTED FAULTS, DISPLAYED BY PERCENTAGE OF OCCURRENCE DURING ALL MOT TESTS
ADVISORY

FAIL

625 UXD annual Faults by type

ALL REPORTED FAULTS, DISPLAYED over time and categorised by type
625 UXD annual Faults by type
ALL REPORTED FAULTS, DISPLAYED over time and categorised by type

ALL 625 UXD ADVISORIES [1]

ALL ADVISORIES, ORDERED by OCCURRENCE DURING 625 UXD's MOT HISTORY
ALL 625 UXD ADVISORIES [1]
ALL ADVISORIES, ORDERED by OCCURRENCE DURING 625 UXD's MOT HISTORY
Advisory Faults | source www.vehiclestats.co.uk
Fault Fault Test Date Test Date/Time Reference MOT Test Reference
1 Brakes imbalanced requirements only just met. It would appear that the braking system requires adjustment or repair. (3.7.b.5b) Brakes imbalanced requirements only just met. It would appear that the braking system requires adjustment or repair. (3.7.b.5b) 29 May 2009 [08:39] 29/05/2009 714949149150 714949149150

ALL 625 UXD Failure Faults [3]

ALL Failure faults, ORDERED by OCCURRENCE DURING 625 UXD's MOT HISTORY
ALL 625 UXD Failure Faults [3]
ALL Failure faults, ORDERED by OCCURRENCE DURING 625 UXD's MOT HISTORY
Fail Faults | source www.vehiclestats.co.uk
Fault Fault Test Date Test Date/Time Reference MOT Test Reference
1 Nearside headlamp not working on dipped beam (1.7.5a) Nearside headlamp not working on dipped beam (1.7.5a) 02 November 2007 [11:22] 02/11/2007 394466907389 394466907389
1 Nearside headlamp not working on main beam (1.7.5a) Nearside headlamp not working on main beam (1.7.5a) 02 November 2007 [11:22] 02/11/2007 394466907389 394466907389
1 Offside headlamp not working on main beam (1.7.5a) Offside headlamp not working on main beam (1.7.5a) 02 November 2007 [11:22] 02/11/2007 394466907389 394466907389

MOT TEST: 29 May 2009 08:39:45 PASSED
MOT TEST: 29 May 2009 08:39:45 PASSED

This test (714949149150) was completed on the 29 May 2009 08:39:45 and PASSED the requirements for a valid MOT with 1 comments.

This test (714949149150) was completed on the 29 May 2009 08:39:45 and PASSED the requirements for a valid MOT with 1 comments.

Recorded mileage: 46,875

Recorded mileage: 46,875


ADVISORY


MOT TEST: 02 November 2007 16:16:55 PASSED
MOT TEST: 02 November 2007 16:16:55 PASSED

This test (302136407372) was completed on the 02 November 2007 16:16:55 and PASSED the requirements for a valid MOT with 0 comments.

This test (302136407372) was completed on the 02 November 2007 16:16:55 and PASSED the requirements for a valid MOT with 0 comments.

Recorded mileage: 46,782

Recorded mileage: 46,782


MOT TEST: 02 November 2007 11:22:26 FAILED
MOT TEST: 02 November 2007 11:22:26 FAILED

This test (394466907389) was completed on the 02 November 2007 11:22:26 and FAILED the requirements for a valid MOT with 3 comments.

This test (394466907389) was completed on the 02 November 2007 11:22:26 and FAILED the requirements for a valid MOT with 3 comments.

Recorded mileage: 46,782

Recorded mileage: 46,782


FAIL


MOT TEST: 28 September 2006 11:51:05 PASSED
MOT TEST: 28 September 2006 11:51:05 PASSED

This test (694561876217) was completed on the 28 September 2006 11:51:05 and PASSED the requirements for a valid MOT with 0 comments.

This test (694561876217) was completed on the 28 September 2006 11:51:05 and PASSED the requirements for a valid MOT with 0 comments.

Recorded mileage: 46,763

Recorded mileage: 46,763