626 HYM


626HYM is registered to a Grey 1963, Morris Minor with a Petrol engine. It Passed its most recent MOT Test on the 08 May 2018

70 unique faults (91 Total) reported in its MOT History (14 Tests).

19 common/recurring faults, the most frequent (3 times) is: Nearside Rear position lamp(s) not working (1.1.A.3b).

43% (6) MOT Pass Rate and a 57% (8) MOT Failure Rate.

27,251 recorded miles.

626 HYM


626HYM is registered to a Grey 1963, Morris Minor with a Petrol engine. It Passed its most recent MOT Test on the 08 May 2018

70 unique faults (91 Total) reported in its MOT History (14 Tests).

19 common/recurring faults, the most frequent (3 times) is: Nearside Rear position lamp(s) not working (1.1.A.3b).

43% (6) MOT Pass Rate and a 57% (8) MOT Failure Rate.

27,251 recorded miles.

MOT PASS/Failure rate for 626 HYM

all MOT test results for 626 HYM represented as a percentage
MOT PASS/Failure rate for 626 HYM
all MOT test results for 626 HYM represented as a percentage

PERCENTAGE OF VEHICLE FAULTS WITH 626 HYM

ALL REPORTED FAULTS, DISPLAYED BY PERCENTAGE OF OCCURRENCE DURING ALL MOT TESTS
PERCENTAGE OF VEHICLE FAULTS WITH 626 HYM
ALL REPORTED FAULTS, DISPLAYED BY PERCENTAGE OF OCCURRENCE DURING ALL MOT TESTS
ADVISORY

FAIL

USER ENTERED

PASS WITH RECTIFICATION

626 HYM annual Faults by type

ALL REPORTED FAULTS, DISPLAYED over time and categorised by type
626 HYM annual Faults by type
ALL REPORTED FAULTS, DISPLAYED over time and categorised by type

RECURRING FAULTS WITH 626 HYM

FAULTS THAT HAVE OCCURED MORE THAN ONCE DURING 626 HYM's MOT HISTORY
RECURRING FAULTS WITH 626 HYM
FAULTS THAT HAVE OCCURED MORE THAN ONCE DURING 626 HYM's MOT HISTORY
Fault Fault Test Date Test Date/Time Reference MOT Test Reference
3 Nearside rear position lamp(s) not working (1.1.a.3b) Nearside rear position lamp(s) not working (1.1.a.3b) 10 April 2017 [11:00] 10/04/2017 14 September 2015 [15:16] 14/09/2015 04 September 2014 [14:23] 04/09/2014 837064375092 837064375092 313409583288 313409583288 129297844264 129297844264
3 Horn not working (1.6.2a) Horn not working (1.6.2a) 04 September 2014 [14:23] 04/09/2014 11 September 2013 [11:47] 11/09/2013 29 September 2011 [11:59] 29/09/2011 129297844264 129297844264 386284053276 386284053276 459592871208 459592871208
2 Offside rear seat belt anchorage prescribed area is corroded but not considered excessive floor (5.2.6) Offside rear seat belt anchorage prescribed area is corroded but not considered excessive floor (5.2.6) 08 May 2018 [15:45] 08/05/2018 25 April 2018 [10:52] 25/04/2018 391451276862 391451276862 948848109407 948848109407
2 Nearside front outer shock absorber has a slightly worn bush (2.7.4) Nearside front outer shock absorber has a slightly worn bush (2.7.4) 08 May 2018 [15:45] 08/05/2018 25 April 2018 [10:52] 25/04/2018 391451276862 391451276862 948848109407 948848109407
2 Registration plate lamp not working (1.1.c.1d) Registration plate lamp not working (1.1.c.1d) 25 April 2018 [10:52] 25/04/2018 04 September 2014 [14:23] 04/09/2014 948848109407 948848109407 129297844264 129297844264
2 Nearside steering rack gaiter deteriorated (2.2.d.2d) Nearside steering rack gaiter deteriorated (2.2.d.2d) 24 May 2017 [15:46] 24/05/2017 16 May 2017 [15:50] 16/05/2017 956457715209 956457715209 379777500395 379777500395
2 Service brake: efficiency below requirements (3.7.b.7) Service brake: efficiency below requirements (3.7.b.7) 16 May 2017 [15:50] 16/05/2017 10 April 2017 [11:00] 10/04/2017 379777500395 379777500395 837064375092 837064375092
2 Brakes imbalanced across an axle (3.7.b.5b) Brakes imbalanced across an axle (3.7.b.5b) 16 May 2017 [15:50] 16/05/2017 29 September 2011 [11:59] 29/09/2011 379777500395 379777500395 459592871208 459592871208
2 Windscreen washer provides insufficient washer liquid (8.2.3) Windscreen washer provides insufficient washer liquid (8.2.3) 10 April 2017 [11:00] 10/04/2017 29 September 2011 [11:59] 29/09/2011 837064375092 837064375092 459592871208 459592871208
2 Offside rear suspension spring mounting prescribed area is excessively corroded (2.4.a.3) Offside rear suspension spring mounting prescribed area is excessively corroded (2.4.a.3) 14 September 2015 [15:16] 14/09/2015 11 September 2013 [11:47] 11/09/2013 313409583288 313409583288 386284053276 386284053276
2 Rear leaf spring has a slightly deteriorated shackle pin rubber bush not resulting in excessive movement (2.4.b.2) Rear leaf spring has a slightly deteriorated shackle pin rubber bush not resulting in excessive movement (2.4.b.2) 18 September 2014 [14:29] 18/09/2014 04 September 2014 [14:23] 04/09/2014 279881764284 279881764284 129297844264 129297844264
2 Front brake pipe slightly corroded (3.6.b.2c) Front brake pipe slightly corroded (3.6.b.2c) 18 September 2014 [14:29] 18/09/2014 04 September 2014 [14:23] 04/09/2014 279881764284 279881764284 129297844264 129297844264
2 Nearside front tyre soft Nearside front tyre soft 18 September 2014 [14:29] 18/09/2014 04 September 2014 [14:23] 04/09/2014 279881764284 279881764284 129297844264 129297844264
2 Nearside rear wing slightly detached Nearside rear wing slightly detached 18 September 2014 [14:29] 18/09/2014 04 September 2014 [14:23] 04/09/2014 279881764284 279881764284 129297844264 129297844264
2 Brake pedal slightly spongy Brake pedal slightly spongy 18 September 2014 [14:29] 18/09/2014 04 September 2014 [14:23] 04/09/2014 279881764284 279881764284 129297844264 129297844264
2 Offside rear seatbelt jammed Offside rear seatbelt jammed 18 September 2014 [14:29] 18/09/2014 04 September 2014 [14:23] 04/09/2014 279881764284 279881764284 129297844264 129297844264
2 Indicator tell tale inoperative (1.4.a.2a) Indicator tell tale inoperative (1.4.a.2a) 04 September 2014 [14:23] 04/09/2014 29 September 2011 [11:59] 29/09/2011 129297844264 129297844264 459592871208 459592871208
2 Coolant leak Coolant leak 13 September 2013 [14:02] 13/09/2013 11 September 2013 [11:47] 11/09/2013 965596553298 965596553298 386284053276 386284053276
2 N/s/f top suspension trunnion has slight play N/s/f top suspension trunnion has slight play 05 July 2012 [17:05] 05/07/2012 05 July 2012 [17:05] 05/07/2012 749007882177 749007882177 835957082124 835957082124

ALL 626 HYM ADVISORIES [12]

ALL ADVISORIES, ORDERED by OCCURRENCE DURING 626 HYM's MOT HISTORY
ALL 626 HYM ADVISORIES [12]
ALL ADVISORIES, ORDERED by OCCURRENCE DURING 626 HYM's MOT HISTORY
Advisory Faults | source www.vehiclestats.co.uk
Fault Fault Test Date Test Date/Time Reference MOT Test Reference
2 Offside rear seat belt anchorage prescribed area is corroded but not considered excessive floor (5.2.6) Offside rear seat belt anchorage prescribed area is corroded but not considered excessive floor (5.2.6) 08 May 2018 [15:45] 08/05/2018 25 April 2018 [10:52] 25/04/2018 391451276862 391451276862 948848109407 948848109407
2 Nearside front outer shock absorber has a slightly worn bush (2.7.4) Nearside front outer shock absorber has a slightly worn bush (2.7.4) 08 May 2018 [15:45] 08/05/2018 25 April 2018 [10:52] 25/04/2018 391451276862 391451276862 948848109407 948848109407
2 Nearside steering rack gaiter deteriorated (2.2.d.2d) Nearside steering rack gaiter deteriorated (2.2.d.2d) 24 May 2017 [15:46] 24/05/2017 16 May 2017 [15:50] 16/05/2017 956457715209 956457715209 379777500395 379777500395
2 Rear leaf spring has a slightly deteriorated shackle pin rubber bush not resulting in excessive movement (2.4.b.2) Rear leaf spring has a slightly deteriorated shackle pin rubber bush not resulting in excessive movement (2.4.b.2) 18 September 2014 [14:29] 18/09/2014 04 September 2014 [14:23] 04/09/2014 279881764284 279881764284 129297844264 129297844264
2 Front brake pipe slightly corroded (3.6.b.2c) Front brake pipe slightly corroded (3.6.b.2c) 18 September 2014 [14:29] 18/09/2014 04 September 2014 [14:23] 04/09/2014 279881764284 279881764284 129297844264 129297844264
1 Oil leak () Oil leak () 10 April 2017 [11:00] 10/04/2017 837064375092 837064375092
1 Offside headlamp deteriorated but light output not reduced (1.7.5a) Offside headlamp deteriorated but light output not reduced (1.7.5a) 29 September 2011 [11:59] 29/09/2011 459592871208 459592871208

ALL 626 HYM Failure Faults [65]

ALL Failure faults, ORDERED by OCCURRENCE DURING 626 HYM's MOT HISTORY
ALL 626 HYM Failure Faults [65]
ALL Failure faults, ORDERED by OCCURRENCE DURING 626 HYM's MOT HISTORY
Fail Faults | source www.vehiclestats.co.uk
Fault Fault Test Date Test Date/Time Reference MOT Test Reference
3 Nearside rear position lamp(s) not working (1.1.a.3b) Nearside rear position lamp(s) not working (1.1.a.3b) 10 April 2017 [11:00] 10/04/2017 14 September 2015 [15:16] 14/09/2015 04 September 2014 [14:23] 04/09/2014 837064375092 837064375092 313409583288 313409583288 129297844264 129297844264
3 Horn not working (1.6.2a) Horn not working (1.6.2a) 04 September 2014 [14:23] 04/09/2014 11 September 2013 [11:47] 11/09/2013 29 September 2011 [11:59] 29/09/2011 129297844264 129297844264 386284053276 386284053276 459592871208 459592871208
2 Registration plate lamp not working (1.1.c.1d) Registration plate lamp not working (1.1.c.1d) 25 April 2018 [10:52] 25/04/2018 04 September 2014 [14:23] 04/09/2014 948848109407 948848109407 129297844264 129297844264
2 Service brake: efficiency below requirements (3.7.b.7) Service brake: efficiency below requirements (3.7.b.7) 16 May 2017 [15:50] 16/05/2017 10 April 2017 [11:00] 10/04/2017 379777500395 379777500395 837064375092 837064375092
2 Brakes imbalanced across an axle (3.7.b.5b) Brakes imbalanced across an axle (3.7.b.5b) 16 May 2017 [15:50] 16/05/2017 29 September 2011 [11:59] 29/09/2011 379777500395 379777500395 459592871208 459592871208
2 Windscreen washer provides insufficient washer liquid (8.2.3) Windscreen washer provides insufficient washer liquid (8.2.3) 10 April 2017 [11:00] 10/04/2017 29 September 2011 [11:59] 29/09/2011 837064375092 837064375092 459592871208 459592871208
2 Offside rear suspension spring mounting prescribed area is excessively corroded (2.4.a.3) Offside rear suspension spring mounting prescribed area is excessively corroded (2.4.a.3) 14 September 2015 [15:16] 14/09/2015 11 September 2013 [11:47] 11/09/2013 313409583288 313409583288 386284053276 386284053276
2 Indicator tell tale inoperative (1.4.a.2a) Indicator tell tale inoperative (1.4.a.2a) 04 September 2014 [14:23] 04/09/2014 29 September 2011 [11:59] 29/09/2011 129297844264 129297844264 459592871208 459592871208
1 Direction indicators not working (1.4.a.2c) Direction indicators not working (1.4.a.2c) 25 April 2018 [10:52] 25/04/2018 948848109407 948848109407
1 Fuel cap/sealing device sealing washer torn (7.2.4c) Fuel cap/sealing device sealing washer torn (7.2.4c) 25 April 2018 [10:52] 25/04/2018 948848109407 948848109407
1 Nearside rear seat belt anchorage prescribed area is excessively corroded floor x2 (5.2.6) Nearside rear seat belt anchorage prescribed area is excessively corroded floor x2 (5.2.6) 25 April 2018 [10:52] 25/04/2018 948848109407 948848109407
1 Nearside windscreen washer provides insufficient washer liquid (8.2.3) Nearside windscreen washer provides insufficient washer liquid (8.2.3) 16 May 2017 [15:50] 16/05/2017 379777500395 379777500395
1 Front passenger door cannot be opened from inside the vehicle (6.2.b.1b) Front passenger door cannot be opened from inside the vehicle (6.2.b.1b) 16 May 2017 [15:50] 16/05/2017 379777500395 379777500395
1 Offside headlamp adversely affected by the operation of another lamp dip & main wrong way around (1.7.5c) Offside headlamp adversely affected by the operation of another lamp dip & main wrong way around (1.7.5c) 16 May 2017 [15:50] 16/05/2017 379777500395 379777500395
1 Brake pipe inadequately clipped front to rear at front (3.6.b.1) Brake pipe inadequately clipped front to rear at front (3.6.b.1) 16 May 2017 [15:50] 16/05/2017 379777500395 379777500395
1 Nearside rear parking brake recording little or no effort (3.7.b.6a) Nearside rear parking brake recording little or no effort (3.7.b.6a) 16 May 2017 [15:50] 16/05/2017 379777500395 379777500395
1 Parking brake: efficiency below requirements (3.7.b.7) Parking brake: efficiency below requirements (3.7.b.7) 16 May 2017 [15:50] 16/05/2017 379777500395 379777500395
1 Nearside headlamp not working on dipped beam (1.7.5a) Nearside headlamp not working on dipped beam (1.7.5a) 10 April 2017 [11:00] 10/04/2017 837064375092 837064375092
1 Brake pedal has insufficient reserve movement (3.3.a.5) Brake pedal has insufficient reserve movement (3.3.a.5) 10 April 2017 [11:00] 10/04/2017 837064375092 837064375092
1 Offside rear seat belt retracting mechanism defective (5.2.5b) Offside rear seat belt retracting mechanism defective (5.2.5b) 10 April 2017 [11:00] 10/04/2017 837064375092 837064375092
1 Offside seat belt anchorage prescribed area is excessively corroded floor (5.2.6) Offside seat belt anchorage prescribed area is excessively corroded floor (5.2.6) 10 April 2017 [11:00] 10/04/2017 837064375092 837064375092
1 Offside rear suspension spring mounting prescribed area is excessively corroded floor (2.4.a.3) Offside rear suspension spring mounting prescribed area is excessively corroded floor (2.4.a.3) 10 April 2017 [11:00] 10/04/2017 837064375092 837064375092
1 Fuel tank leaking (7.2.3) Fuel tank leaking (7.2.3) 10 April 2017 [11:00] 10/04/2017 837064375092 837064375092
1 Brake pipe inadequately clipped front of front to rear (3.6.b.1) Brake pipe inadequately clipped front of front to rear (3.6.b.1) 10 April 2017 [11:00] 10/04/2017 837064375092 837064375092
1 Offside front brake pipe fouled by moving parts (3.6.b.2a) Offside front brake pipe fouled by moving parts (3.6.b.2a) 10 April 2017 [11:00] 10/04/2017 837064375092 837064375092
1 Front brake recording little or no effort (3.7.b.5a) Front brake recording little or no effort (3.7.b.5a) 10 April 2017 [11:00] 10/04/2017 837064375092 837064375092
1 Front brake binding due to brake condition unable to check wheel bearing (3.7.b.1) Front brake binding due to brake condition unable to check wheel bearing (3.7.b.1) 10 April 2017 [11:00] 10/04/2017 837064375092 837064375092
1 Rear brake recording little or no effort (3.7.b.5a) Rear brake recording little or no effort (3.7.b.5a) 10 April 2017 [11:00] 10/04/2017 837064375092 837064375092
1 Offside rear brake binding due to brake condition unable to check wheel bearing (3.7.b.1) Offside rear brake binding due to brake condition unable to check wheel bearing (3.7.b.1) 10 April 2017 [11:00] 10/04/2017 837064375092 837064375092
1 Nearside front direction indicator not working (1.4.a.2c) Nearside front direction indicator not working (1.4.a.2c) 14 September 2015 [15:16] 14/09/2015 313409583288 313409583288
1 Offside headlamp aim does not move downwards when dipped (british american headlamp) (1.8.c.4) Offside headlamp aim does not move downwards when dipped (british american headlamp) (1.8.c.4) 14 September 2015 [15:16] 14/09/2015 313409583288 313409583288
1 Nearside front suspension spring mounting prescribed area is excessively corroded (2.4.a.3) Nearside front suspension spring mounting prescribed area is excessively corroded (2.4.a.3) 14 September 2015 [15:16] 14/09/2015 313409583288 313409583288
1 Nearside front suspension has excessive play in a upper wishbone bearing trunion (2.5.b.1a) Nearside front suspension has excessive play in a upper wishbone bearing trunion (2.5.b.1a) 14 September 2015 [15:16] 14/09/2015 313409583288 313409583288
1 Offside front tyre has ply or cords exposed (4.1.d.1b) Offside front tyre has ply or cords exposed (4.1.d.1b) 14 September 2015 [15:16] 14/09/2015 313409583288 313409583288
1 Nearside rear position lamp(s) insecure (1.1.a.3a) Nearside rear position lamp(s) insecure (1.1.a.3a) 04 September 2014 [14:23] 04/09/2014 129297844264 129297844264
1 Rear direction indicator not working (1.4.a.2c) Rear direction indicator not working (1.4.a.2c) 04 September 2014 [14:23] 04/09/2014 129297844264 129297844264
1 Front direction indicator flashing less than 60 times a minute (1.4.a.2g) Front direction indicator flashing less than 60 times a minute (1.4.a.2g) 04 September 2014 [14:23] 04/09/2014 129297844264 129297844264
1 Stop lamp not working (1.2.1b) Stop lamp not working (1.2.1b) 04 September 2014 [14:23] 04/09/2014 129297844264 129297844264
1 Battery insecure (1.9.1) Battery insecure (1.9.1) 04 September 2014 [14:23] 04/09/2014 129297844264 129297844264
1 Nearside front upper axle king pin has excessive play in pin and/or bush adversely affecting the steering (2.5.a.3a) Nearside front upper axle king pin has excessive play in pin and/or bush adversely affecting the steering (2.5.a.3a) 04 September 2014 [14:23] 04/09/2014 129297844264 129297844264
1 Headlamp switch faulty (1.7.1) Headlamp switch faulty (1.7.1) 11 September 2013 [11:47] 11/09/2013 386284053276 386284053276
1 Nearside rear suspension spring mounting prescribed area is excessively corroded (2.4.a.3) Nearside rear suspension spring mounting prescribed area is excessively corroded (2.4.a.3) 11 September 2013 [11:47] 11/09/2013 386284053276 386284053276
1 Offside rear suspension spring mounting prescribed area is fractured (2.4.a.3) Offside rear suspension spring mounting prescribed area is fractured (2.4.a.3) 11 September 2013 [11:47] 11/09/2013 386284053276 386284053276
1 Rear brake hose excessively deteriorated (3.6.b.4d) Rear brake hose excessively deteriorated (3.6.b.4d) 11 September 2013 [11:47] 11/09/2013 386284053276 386284053276
1 Offside rear shock absorber insecure (2.7.2b) Offside rear shock absorber insecure (2.7.2b) 11 September 2013 [11:47] 11/09/2013 386284053276 386284053276
1 Nearside windscreen wiper not operating over a large enough area to give an adequate view (8.2.1c) Nearside windscreen wiper not operating over a large enough area to give an adequate view (8.2.1c) 29 September 2011 [11:59] 29/09/2011 459592871208 459592871208
1 Nearside windscreen wiper blade insecure (8.2.2) Nearside windscreen wiper blade insecure (8.2.2) 29 September 2011 [11:59] 29/09/2011 459592871208 459592871208
1 Nearside rear suspension spring mounting prescribed area is inadequately repaired (2.4.a.3) Nearside rear suspension spring mounting prescribed area is inadequately repaired (2.4.a.3) 29 September 2011 [11:59] 29/09/2011 459592871208 459592871208
1 Offside rear suspension spring mounting prescribed area is inadequately repaired (2.4.a.3) Offside rear suspension spring mounting prescribed area is inadequately repaired (2.4.a.3) 29 September 2011 [11:59] 29/09/2011 459592871208 459592871208
1 Bootlid cannot be secured in the closed position (6.4.1) Bootlid cannot be secured in the closed position (6.4.1) 29 September 2011 [11:59] 29/09/2011 459592871208 459592871208
1 Brake pipe inadequately clipped (3.6.b.1) Brake pipe inadequately clipped (3.6.b.1) 29 September 2011 [11:59] 29/09/2011 459592871208 459592871208
1 Nearside front brake pipe inadequately clipped (3.6.b.1) Nearside front brake pipe inadequately clipped (3.6.b.1) 29 September 2011 [11:59] 29/09/2011 459592871208 459592871208
1 Offside rear shock absorber has a serious fluid leak (2.7.3) Offside rear shock absorber has a serious fluid leak (2.7.3) 29 September 2011 [11:59] 29/09/2011 459592871208 459592871208
1 Nearside front brake binding (3.7.b.1) Nearside front brake binding (3.7.b.1) 29 September 2011 [11:59] 29/09/2011 459592871208 459592871208
1 Offside rear brake recording little or no effort (3.7.b.5a) Offside rear brake recording little or no effort (3.7.b.5a) 29 September 2011 [11:59] 29/09/2011 459592871208 459592871208

ALL 626 HYM User Entered Faults [13]

ALL User Entered faults, ORDERED by OCCURRENCE DURING 626 HYM's MOT HISTORY
ALL 626 HYM User Entered Faults [13]
ALL User Entered faults, ORDERED by OCCURRENCE DURING 626 HYM's MOT HISTORY
Advisory Faults | source www.vehiclestats.co.uk
Fault Fault Test Date Test Date/Time Reference MOT Test Reference
2 Nearside front tyre soft Nearside front tyre soft 18 September 2014 [14:29] 18/09/2014 04 September 2014 [14:23] 04/09/2014 279881764284 279881764284 129297844264 129297844264
2 Nearside rear wing slightly detached Nearside rear wing slightly detached 18 September 2014 [14:29] 18/09/2014 04 September 2014 [14:23] 04/09/2014 279881764284 279881764284 129297844264 129297844264
2 Brake pedal slightly spongy Brake pedal slightly spongy 18 September 2014 [14:29] 18/09/2014 04 September 2014 [14:23] 04/09/2014 279881764284 279881764284 129297844264 129297844264
2 Offside rear seatbelt jammed Offside rear seatbelt jammed 18 September 2014 [14:29] 18/09/2014 04 September 2014 [14:23] 04/09/2014 279881764284 279881764284 129297844264 129297844264
2 Coolant leak Coolant leak 13 September 2013 [14:02] 13/09/2013 11 September 2013 [11:47] 11/09/2013 965596553298 965596553298 386284053276 386284053276
2 N/s/f top suspension trunnion has slight play N/s/f top suspension trunnion has slight play 05 July 2012 [17:05] 05/07/2012 05 July 2012 [17:05] 05/07/2012 749007882177 749007882177 835957082124 835957082124
1 Nearside rear hub oil seal, & diff. Pinion oil seal leaking. Nearside rear hub oil seal, & diff. Pinion oil seal leaking. 29 September 2011 [11:59] 29/09/2011 459592871208 459592871208

ALL 626 HYM Pass With Rectification Faults [1]

ALL Pass With Rectification faults, ORDERED by OCCURRENCE DURING 626 HYM's MOT HISTORY
ALL 626 HYM Pass With Rectification Faults [1]
ALL Pass With Rectification faults, ORDERED by OCCURRENCE DURING 626 HYM's MOT HISTORY
Pass With Rectification Faults | source www.vehiclestats.co.uk
Fault Fault Test Date Test Date/Time Reference MOT Test Reference
1 Front windscreen washer provides insufficient washer liquid (8.2.3) Front windscreen washer provides insufficient washer liquid (8.2.3) 05 July 2012 [17:05] 05/07/2012 835957082124 835957082124

MOT TEST: 08 May 2018 15:45:26 PASSED
MOT TEST: 08 May 2018 15:45:26 PASSED

This test (391451276862) was completed on the 08 May 2018 15:45:26 and PASSED the requirements for a valid MOT with 2 comments.

This test (391451276862) was completed on the 08 May 2018 15:45:26 and PASSED the requirements for a valid MOT with 2 comments.

Recorded mileage: 27,251

Recorded mileage: 27,251


ADVISORY


MOT TEST: 25 April 2018 10:52:56 FAILED
MOT TEST: 25 April 2018 10:52:56 FAILED

This test (948848109407) was completed on the 25 April 2018 10:52:56 and FAILED the requirements for a valid MOT with 6 comments.

This test (948848109407) was completed on the 25 April 2018 10:52:56 and FAILED the requirements for a valid MOT with 6 comments.

Recorded mileage: 27,251

Recorded mileage: 27,251


ADVISORY

FAIL


MOT TEST: 24 May 2017 15:46:20 PASSED
MOT TEST: 24 May 2017 15:46:20 PASSED

This test (956457715209) was completed on the 24 May 2017 15:46:20 and PASSED the requirements for a valid MOT with 1 comments.

This test (956457715209) was completed on the 24 May 2017 15:46:20 and PASSED the requirements for a valid MOT with 1 comments.

Recorded mileage: 26,953

Recorded mileage: 26,953


ADVISORY


MOT TEST: 16 May 2017 15:50:21 FAILED
MOT TEST: 16 May 2017 15:50:21 FAILED

This test (379777500395) was completed on the 16 May 2017 15:50:21 and FAILED the requirements for a valid MOT with 9 comments.

This test (379777500395) was completed on the 16 May 2017 15:50:21 and FAILED the requirements for a valid MOT with 9 comments.

Recorded mileage: 26,951

Recorded mileage: 26,951


ADVISORY

FAIL


MOT TEST: 10 April 2017 11:00:17 FAILED
MOT TEST: 10 April 2017 11:00:17 FAILED

This test (837064375092) was completed on the 10 April 2017 11:00:17 and FAILED the requirements for a valid MOT with 16 comments.

This test (837064375092) was completed on the 10 April 2017 11:00:17 and FAILED the requirements for a valid MOT with 16 comments.

Recorded mileage: 26,950

Recorded mileage: 26,950


ADVISORY

FAIL


MOT TEST: 23 September 2015 15:20:24 PASSED
MOT TEST: 23 September 2015 15:20:24 PASSED

This test (760771102580) was completed on the 23 September 2015 15:20:24 and PASSED the requirements for a valid MOT with 0 comments.

This test (760771102580) was completed on the 23 September 2015 15:20:24 and PASSED the requirements for a valid MOT with 0 comments.

Recorded mileage: 26,900

Recorded mileage: 26,900


MOT TEST: 14 September 2015 15:16:31 FAILED
MOT TEST: 14 September 2015 15:16:31 FAILED

This test (313409583288) was completed on the 14 September 2015 15:16:31 and FAILED the requirements for a valid MOT with 7 comments.

This test (313409583288) was completed on the 14 September 2015 15:16:31 and FAILED the requirements for a valid MOT with 7 comments.

Recorded mileage: 26,900

Recorded mileage: 26,900


FAIL


MOT TEST: 18 September 2014 14:29:58 PASSED
MOT TEST: 18 September 2014 14:29:58 PASSED

This test (279881764284) was completed on the 18 September 2014 14:29:58 and PASSED the requirements for a valid MOT with 6 comments.

This test (279881764284) was completed on the 18 September 2014 14:29:58 and PASSED the requirements for a valid MOT with 6 comments.

Recorded mileage: 25,861

Recorded mileage: 25,861


ADVISORY

USER ENTERED


MOT TEST: 04 September 2014 14:23:09 FAILED
MOT TEST: 04 September 2014 14:23:09 FAILED

This test (129297844264) was completed on the 04 September 2014 14:23:09 and FAILED the requirements for a valid MOT with 16 comments.

This test (129297844264) was completed on the 04 September 2014 14:23:09 and FAILED the requirements for a valid MOT with 16 comments.

Recorded mileage: 25,856

Recorded mileage: 25,856


ADVISORY

FAIL

USER ENTERED


MOT TEST: 13 September 2013 14:02:27 PASSED
MOT TEST: 13 September 2013 14:02:27 PASSED

This test (965596553298) was completed on the 13 September 2013 14:02:27 and PASSED the requirements for a valid MOT with 1 comments.

This test (965596553298) was completed on the 13 September 2013 14:02:27 and PASSED the requirements for a valid MOT with 1 comments.

Recorded mileage: 25,419

Recorded mileage: 25,419


USER ENTERED


MOT TEST: 11 September 2013 11:47:41 FAILED
MOT TEST: 11 September 2013 11:47:41 FAILED

This test (386284053276) was completed on the 11 September 2013 11:47:41 and FAILED the requirements for a valid MOT with 8 comments.

This test (386284053276) was completed on the 11 September 2013 11:47:41 and FAILED the requirements for a valid MOT with 8 comments.

Recorded mileage: 25,419

Recorded mileage: 25,419


FAIL

USER ENTERED


MOT TEST: 05 July 2012 17:05:01 PASSED
MOT TEST: 05 July 2012 17:05:01 PASSED

This test (749007882177) was completed on the 05 July 2012 17:05:01 and PASSED the requirements for a valid MOT with 1 comments.

This test (749007882177) was completed on the 05 July 2012 17:05:01 and PASSED the requirements for a valid MOT with 1 comments.

Recorded mileage: 24,906

Recorded mileage: 24,906


USER ENTERED


MOT TEST: 05 July 2012 17:05:01 FAILED
MOT TEST: 05 July 2012 17:05:01 FAILED

This test (835957082124) was completed on the 05 July 2012 17:05:01 and FAILED the requirements for a valid MOT with 2 comments.

This test (835957082124) was completed on the 05 July 2012 17:05:01 and FAILED the requirements for a valid MOT with 2 comments.

Recorded mileage: 24,906

Recorded mileage: 24,906


USER ENTERED

PASS WITH RECTIFICATION


MOT TEST: 29 September 2011 11:59:50 FAILED
MOT TEST: 29 September 2011 11:59:50 FAILED

This test (459592871208) was completed on the 29 September 2011 11:59:50 and FAILED the requirements for a valid MOT with 16 comments.

This test (459592871208) was completed on the 29 September 2011 11:59:50 and FAILED the requirements for a valid MOT with 16 comments.

Recorded mileage: 24,898

Recorded mileage: 24,898


ADVISORY

FAIL

USER ENTERED