626 UYK


626UYK is registered to a Grey 1961, Morris Minor 1000 with a Petrol engine. It Failed its most recent MOT Test on the 23 June 2017

14 unique faults (20 Total) reported in its MOT History (4 Tests).

3 common/recurring faults, the most frequent (3 times) is: Front Brake pipe slightly corroded (3.6.B.2c).

75% (3) MOT Pass Rate and a 25% (1) MOT Failure Rate.

43,580 recorded miles.

626 UYK


626UYK is registered to a Grey 1961, Morris Minor 1000 with a Petrol engine. It Failed its most recent MOT Test on the 23 June 2017

14 unique faults (20 Total) reported in its MOT History (4 Tests).

3 common/recurring faults, the most frequent (3 times) is: Front Brake pipe slightly corroded (3.6.B.2c).

75% (3) MOT Pass Rate and a 25% (1) MOT Failure Rate.

43,580 recorded miles.

MOT PASS/Failure rate for 626 UYK

all MOT test results for 626 UYK represented as a percentage
MOT PASS/Failure rate for 626 UYK
all MOT test results for 626 UYK represented as a percentage

PERCENTAGE OF VEHICLE FAULTS WITH 626 UYK

ALL REPORTED FAULTS, DISPLAYED BY PERCENTAGE OF OCCURRENCE DURING ALL MOT TESTS
PERCENTAGE OF VEHICLE FAULTS WITH 626 UYK
ALL REPORTED FAULTS, DISPLAYED BY PERCENTAGE OF OCCURRENCE DURING ALL MOT TESTS
ADVISORY

FAIL

USER ENTERED

626 UYK annual Faults by type

ALL REPORTED FAULTS, DISPLAYED over time and categorised by type
626 UYK annual Faults by type
ALL REPORTED FAULTS, DISPLAYED over time and categorised by type

RECURRING FAULTS WITH 626 UYK

FAULTS THAT HAVE OCCURED MORE THAN ONCE DURING 626 UYK's MOT HISTORY
RECURRING FAULTS WITH 626 UYK
FAULTS THAT HAVE OCCURED MORE THAN ONCE DURING 626 UYK's MOT HISTORY
Fault Fault Test Date Test Date/Time Reference MOT Test Reference
3 Front brake pipe slightly corroded (3.6.b.2c) Front brake pipe slightly corroded (3.6.b.2c) 07 January 2015 [16:46] 07/01/2015 05 March 2013 [09:04] 05/03/2013 22 February 2013 [10:33] 22/02/2013 866097105022 866097105022 276464963050 276464963050 356443053074 356443053074
3 Centre front brake pipe slightly corroded (3.6.b.2c) Centre front brake pipe slightly corroded (3.6.b.2c) 07 January 2015 [16:46] 07/01/2015 05 March 2013 [09:04] 05/03/2013 22 February 2013 [10:33] 22/02/2013 866097105022 866097105022 276464963050 276464963050 356443053074 356443053074
3 Centre front lower suspension component mounting prescribed area is corroded but not considered excessive (2.4.a.3) Centre front lower suspension component mounting prescribed area is corroded but not considered excessive (2.4.a.3) 07 January 2015 [16:46] 07/01/2015 05 March 2013 [09:04] 05/03/2013 22 February 2013 [10:33] 22/02/2013 866097105022 866097105022 276464963050 276464963050 356443053074 356443053074

ALL 626 UYK ADVISORIES [11]

ALL ADVISORIES, ORDERED by OCCURRENCE DURING 626 UYK's MOT HISTORY
ALL 626 UYK ADVISORIES [11]
ALL ADVISORIES, ORDERED by OCCURRENCE DURING 626 UYK's MOT HISTORY
Advisory Faults | source www.vehiclestats.co.uk
Fault Fault Test Date Test Date/Time Reference MOT Test Reference
3 Front brake pipe slightly corroded (3.6.b.2c) Front brake pipe slightly corroded (3.6.b.2c) 07 January 2015 [16:46] 07/01/2015 05 March 2013 [09:04] 05/03/2013 22 February 2013 [10:33] 22/02/2013 866097105022 866097105022 276464963050 276464963050 356443053074 356443053074
3 Centre front brake pipe slightly corroded (3.6.b.2c) Centre front brake pipe slightly corroded (3.6.b.2c) 07 January 2015 [16:46] 07/01/2015 05 March 2013 [09:04] 05/03/2013 22 February 2013 [10:33] 22/02/2013 866097105022 866097105022 276464963050 276464963050 356443053074 356443053074
3 Centre front lower suspension component mounting prescribed area is corroded but not considered excessive (2.4.a.3) Centre front lower suspension component mounting prescribed area is corroded but not considered excessive (2.4.a.3) 07 January 2015 [16:46] 07/01/2015 05 March 2013 [09:04] 05/03/2013 22 February 2013 [10:33] 22/02/2013 866097105022 866097105022 276464963050 276464963050 356443053074 356443053074
1 Offside rear lower anti-roll bar linkage has slight play in a ball joint (2.4.g.2) Offside rear lower anti-roll bar linkage has slight play in a ball joint (2.4.g.2) 22 February 2013 [10:33] 22/02/2013 356443053074 356443053074
1 Nearside rear tyre worn close to the legal limit (4.1.e.1) Nearside rear tyre worn close to the legal limit (4.1.e.1) 22 February 2013 [10:33] 22/02/2013 356443053074 356443053074

ALL 626 UYK Failure Faults [8]

ALL Failure faults, ORDERED by OCCURRENCE DURING 626 UYK's MOT HISTORY
ALL 626 UYK Failure Faults [8]
ALL Failure faults, ORDERED by OCCURRENCE DURING 626 UYK's MOT HISTORY
Fail Faults | source www.vehiclestats.co.uk
Fault Fault Test Date Test Date/Time Reference MOT Test Reference
1 All position lamps not working (1.1.a.3b) All position lamps not working (1.1.a.3b) 22 February 2013 [10:33] 22/02/2013 356443053074 356443053074
1 Nearside front headlamp not working on dipped beam (1.7.5a) Nearside front headlamp not working on dipped beam (1.7.5a) 22 February 2013 [10:33] 22/02/2013 356443053074 356443053074
1 Offside front headlamp not working on dipped beam (1.7.5a) Offside front headlamp not working on dipped beam (1.7.5a) 22 February 2013 [10:33] 22/02/2013 356443053074 356443053074
1 Front windscreen washer provides insufficient washer liquid (8.2.3) Front windscreen washer provides insufficient washer liquid (8.2.3) 22 February 2013 [10:33] 22/02/2013 356443053074 356443053074
1 Offside front lower body has a sharp edge caused by corrosion (6.1.c.1) Offside front lower body has a sharp edge caused by corrosion (6.1.c.1) 22 February 2013 [10:33] 22/02/2013 356443053074 356443053074
1 Offside front lower body or chassis has excessive corrosion, seriously affecting its strength within 30cm of the body mountings (6.1.b.2) Offside front lower body or chassis has excessive corrosion, seriously affecting its strength within 30cm of the body mountings (6.1.b.2) 22 February 2013 [10:33] 22/02/2013 356443053074 356443053074
1 Offside rear tyre tread depth below requirements of 1.6mm (4.1.e.1) Offside rear tyre tread depth below requirements of 1.6mm (4.1.e.1) 22 February 2013 [10:33] 22/02/2013 356443053074 356443053074
1 Parking brake: efficiency below requirements (3.7.b.7) Parking brake: efficiency below requirements (3.7.b.7) 22 February 2013 [10:33] 22/02/2013 356443053074 356443053074

ALL 626 UYK User Entered Faults [1]

ALL User Entered faults, ORDERED by OCCURRENCE DURING 626 UYK's MOT HISTORY
ALL 626 UYK User Entered Faults [1]
ALL User Entered faults, ORDERED by OCCURRENCE DURING 626 UYK's MOT HISTORY
Fail Faults | source www.vehiclestats.co.uk
Fault Fault Test Date Test Date/Time Reference MOT Test Reference
1 Exhaust system deteriorated Exhaust system deteriorated 22 February 2013 [10:33] 22/02/2013 356443053074 356443053074

MOT TEST: 23 June 2017 13:22:48 PASSED
MOT TEST: 23 June 2017 13:22:48 PASSED

This test (811124786424) was completed on the 23 June 2017 13:22:48 and PASSED the requirements for a valid MOT with 0 comments.

This test (811124786424) was completed on the 23 June 2017 13:22:48 and PASSED the requirements for a valid MOT with 0 comments.

Recorded mileage: 43,580

Recorded mileage: 43,580


MOT TEST: 07 January 2015 16:46:59 PASSED
MOT TEST: 07 January 2015 16:46:59 PASSED

This test (866097105022) was completed on the 07 January 2015 16:46:59 and PASSED the requirements for a valid MOT with 3 comments.

This test (866097105022) was completed on the 07 January 2015 16:46:59 and PASSED the requirements for a valid MOT with 3 comments.

Recorded mileage: 25,330

Recorded mileage: 25,330


ADVISORY


MOT TEST: 05 March 2013 09:04:53 PASSED
MOT TEST: 05 March 2013 09:04:53 PASSED

This test (276464963050) was completed on the 05 March 2013 09:04:53 and PASSED the requirements for a valid MOT with 3 comments.

This test (276464963050) was completed on the 05 March 2013 09:04:53 and PASSED the requirements for a valid MOT with 3 comments.

Recorded mileage: 25,290

Recorded mileage: 25,290


ADVISORY


MOT TEST: 22 February 2013 10:33:52 FAILED
MOT TEST: 22 February 2013 10:33:52 FAILED

This test (356443053074) was completed on the 22 February 2013 10:33:52 and FAILED the requirements for a valid MOT with 14 comments.

This test (356443053074) was completed on the 22 February 2013 10:33:52 and FAILED the requirements for a valid MOT with 14 comments.

Recorded mileage: 25,278

Recorded mileage: 25,278


ADVISORY

FAIL

USER ENTERED