627 UXE


627UXE is registered to a Black 1971, Morris Minor 1000 with a Petrol engine. It Failed its most recent MOT Test on the 13 May 2015

32 unique faults (38 Total) reported in its MOT History (10 Tests).

5 common/recurring faults, the most frequent (3 times) is: Parking brake: efficiency below requirements (3.7.B.7).

50% (5) MOT Pass Rate and a 50% (5) MOT Failure Rate.

41,999 recorded miles.

627 UXE


627UXE is registered to a Black 1971, Morris Minor 1000 with a Petrol engine. It Failed its most recent MOT Test on the 13 May 2015

32 unique faults (38 Total) reported in its MOT History (10 Tests).

5 common/recurring faults, the most frequent (3 times) is: Parking brake: efficiency below requirements (3.7.B.7).

50% (5) MOT Pass Rate and a 50% (5) MOT Failure Rate.

41,999 recorded miles.

MOT PASS/Failure rate for 627 UXE

all MOT test results for 627 UXE represented as a percentage
MOT PASS/Failure rate for 627 UXE
all MOT test results for 627 UXE represented as a percentage

PERCENTAGE OF VEHICLE FAULTS WITH 627 UXE

ALL REPORTED FAULTS, DISPLAYED BY PERCENTAGE OF OCCURRENCE DURING ALL MOT TESTS
PERCENTAGE OF VEHICLE FAULTS WITH 627 UXE
ALL REPORTED FAULTS, DISPLAYED BY PERCENTAGE OF OCCURRENCE DURING ALL MOT TESTS
ADVISORY

FAIL

USER ENTERED

627 UXE annual Faults by type

ALL REPORTED FAULTS, DISPLAYED over time and categorised by type
627 UXE annual Faults by type
ALL REPORTED FAULTS, DISPLAYED over time and categorised by type

RECURRING FAULTS WITH 627 UXE

FAULTS THAT HAVE OCCURED MORE THAN ONCE DURING 627 UXE's MOT HISTORY
RECURRING FAULTS WITH 627 UXE
FAULTS THAT HAVE OCCURED MORE THAN ONCE DURING 627 UXE's MOT HISTORY
Fault Fault Test Date Test Date/Time Reference MOT Test Reference
3 Parking brake: efficiency below requirements (3.7.b.7) Parking brake: efficiency below requirements (3.7.b.7) 13 May 2015 [15:08] 13/05/2015 24 August 2010 [09:32] 24/08/2010 29 August 2008 [13:56] 29/08/2008 838713835163 838713835163 844766030282 844766030282 900152448212 900152448212
2 Nearside steering rack gaiter split (2.2.d.2d) Nearside steering rack gaiter split (2.2.d.2d) 13 May 2015 [15:08] 13/05/2015 17 August 2006 [11:58] 17/08/2006 838713835163 838713835163 242049726217 242049726217
2 Service brake: efficiency below requirements (3.7.b.7) Service brake: efficiency below requirements (3.7.b.7) 24 August 2010 [09:32] 24/08/2010 17 August 2006 [11:58] 17/08/2006 844766030282 844766030282 242049726217 242049726217
2 Slight inbalance front brakes. Slight inbalance front brakes. 05 September 2008 [14:38] 05/09/2008 29 August 2008 [13:56] 29/08/2008 124089748216 124089748216 900152448212 900152448212
2 Slight binding n/s/front brake. Slight binding n/s/front brake. 05 September 2008 [14:38] 05/09/2008 29 August 2008 [13:56] 29/08/2008 124089748216 124089748216 900152448212 900152448212

ALL 627 UXE ADVISORIES [3]

ALL ADVISORIES, ORDERED by OCCURRENCE DURING 627 UXE's MOT HISTORY
ALL 627 UXE ADVISORIES [3]
ALL ADVISORIES, ORDERED by OCCURRENCE DURING 627 UXE's MOT HISTORY
Fail Faults | source www.vehiclestats.co.uk
Fault Fault Test Date Test Date/Time Reference MOT Test Reference
1 Nearside front suspension has slight movement at a wishbone pin or bush (2.5.a.1c) Nearside front suspension has slight movement at a wishbone pin or bush (2.5.a.1c) 13 May 2015 [15:08] 13/05/2015 838713835163 838713835163
1 Offside front suspension has slight movement at a wishbone pin or bush (2.5.a.1c) Offside front suspension has slight movement at a wishbone pin or bush (2.5.a.1c) 13 May 2015 [15:08] 13/05/2015 838713835163 838713835163
1 Headlamp deteriorated but light output not reduced (1.7.5a) Headlamp deteriorated but light output not reduced (1.7.5a) 13 March 2012 [12:38] 13/03/2012 676863772011 676863772011

ALL 627 UXE Failure Faults [28]

ALL Failure faults, ORDERED by OCCURRENCE DURING 627 UXE's MOT HISTORY
ALL 627 UXE Failure Faults [28]
ALL Failure faults, ORDERED by OCCURRENCE DURING 627 UXE's MOT HISTORY
Fail Faults | source www.vehiclestats.co.uk
Fault Fault Test Date Test Date/Time Reference MOT Test Reference
3 Parking brake: efficiency below requirements (3.7.b.7) Parking brake: efficiency below requirements (3.7.b.7) 13 May 2015 [15:08] 13/05/2015 24 August 2010 [09:32] 24/08/2010 29 August 2008 [13:56] 29/08/2008 838713835163 838713835163 844766030282 844766030282 900152448212 900152448212
2 Nearside steering rack gaiter split (2.2.d.2d) Nearside steering rack gaiter split (2.2.d.2d) 13 May 2015 [15:08] 13/05/2015 17 August 2006 [11:58] 17/08/2006 838713835163 838713835163 242049726217 242049726217
2 Service brake: efficiency below requirements (3.7.b.7) Service brake: efficiency below requirements (3.7.b.7) 24 August 2010 [09:32] 24/08/2010 17 August 2006 [11:58] 17/08/2006 844766030282 844766030282 242049726217 242049726217
1 Nearside windscreen wiper not operating automatically when switched on (8.2.1b) Nearside windscreen wiper not operating automatically when switched on (8.2.1b) 13 May 2015 [15:08] 13/05/2015 838713835163 838713835163
1 Offside windscreen wiper not operating automatically when switched on (8.2.1b) Offside windscreen wiper not operating automatically when switched on (8.2.1b) 13 May 2015 [15:08] 13/05/2015 838713835163 838713835163
1 Nearside front direction indicator not working (1.4.a.2c) Nearside front direction indicator not working (1.4.a.2c) 13 May 2015 [15:08] 13/05/2015 838713835163 838713835163
1 Nearside rear direction indicator not working (1.4.a.2c) Nearside rear direction indicator not working (1.4.a.2c) 13 May 2015 [15:08] 13/05/2015 838713835163 838713835163
1 Nearside rear brake binding (3.7.b.1) Nearside rear brake binding (3.7.b.1) 13 May 2015 [15:08] 13/05/2015 838713835163 838713835163
1 Offside rear brake binding (3.7.b.1) Offside rear brake binding (3.7.b.1) 13 May 2015 [15:08] 13/05/2015 838713835163 838713835163
1 Nearside rear brake recording little or no effort (3.7.b.5a) Nearside rear brake recording little or no effort (3.7.b.5a) 13 May 2015 [15:08] 13/05/2015 838713835163 838713835163
1 Nearside rear parking brake recording little or no effort (3.7.b.6a) Nearside rear parking brake recording little or no effort (3.7.b.6a) 13 May 2015 [15:08] 13/05/2015 838713835163 838713835163
1 Rear rear brake application uneven (3.7.b.2) Rear rear brake application uneven (3.7.b.2) 13 May 2015 [15:08] 13/05/2015 838713835163 838713835163
1 Brakes imbalanced across an axle (3.7.b.5b) Brakes imbalanced across an axle (3.7.b.5b) 13 May 2015 [15:08] 13/05/2015 838713835163 838713835163
1 Nearside rear registration plate lamp not working (1.1.c.1d) Nearside rear registration plate lamp not working (1.1.c.1d) 24 August 2010 [09:32] 24/08/2010 844766030282 844766030282
1 Nearside rear windscreen washer provides insufficient washer liquid (8.2.3) Nearside rear windscreen washer provides insufficient washer liquid (8.2.3) 24 August 2010 [09:32] 24/08/2010 844766030282 844766030282
1 Offside rear body or chassis has excessive corrosion, seriously affecting its strength within 30cm of the body mountings (6.1.b.2) Offside rear body or chassis has excessive corrosion, seriously affecting its strength within 30cm of the body mountings (6.1.b.2) 24 August 2010 [09:32] 24/08/2010 844766030282 844766030282
1 Nearside vehicle structure has excessive corrosion, seriously affecting its strength within 30cm of the body mountings (6.1.b.2) Nearside vehicle structure has excessive corrosion, seriously affecting its strength within 30cm of the body mountings (6.1.b.2) 24 August 2010 [09:32] 24/08/2010 844766030282 844766030282
1 Front statutory seat belt missing (5.1.1) Front statutory seat belt missing (5.1.1) 29 August 2008 [13:56] 29/08/2008 900152448212 900152448212
1 Nearside front suspension arm has excessive play in a pin/bush (2.4.g.2) Nearside front suspension arm has excessive play in a pin/bush (2.4.g.2) 29 August 2008 [13:56] 29/08/2008 900152448212 900152448212
1 Offside front suspension arm has excessive play in a pin/bush (2.4.g.2) Offside front suspension arm has excessive play in a pin/bush (2.4.g.2) 29 August 2008 [13:56] 29/08/2008 900152448212 900152448212
1 Exhaust has a major leak of exhaust gases (7.1.2) Exhaust has a major leak of exhaust gases (7.1.2) 29 August 2008 [13:56] 29/08/2008 900152448212 900152448212
1 Offside front vehicle structure has excessive corrosion, seriously affecting its strength within 30cm of the body mountings (6.1.b.2) Offside front vehicle structure has excessive corrosion, seriously affecting its strength within 30cm of the body mountings (6.1.b.2) 14 August 2007 [13:03] 14/08/2007 233896927221 233896927221
1 Steering column shaft has excessive end float (2.1.3) Steering column shaft has excessive end float (2.1.3) 17 August 2006 [11:58] 17/08/2006 242049726217 242049726217
1 Windscreen washer control is inaccessible to the driver (8.2.1a) Windscreen washer control is inaccessible to the driver (8.2.1a) 17 August 2006 [11:58] 17/08/2006 242049726217 242049726217

ALL 627 UXE User Entered Faults [7]

ALL User Entered faults, ORDERED by OCCURRENCE DURING 627 UXE's MOT HISTORY
ALL 627 UXE User Entered Faults [7]
ALL User Entered faults, ORDERED by OCCURRENCE DURING 627 UXE's MOT HISTORY
User Entered Faults | source www.vehiclestats.co.uk
Fault Fault Test Date Test Date/Time Reference MOT Test Reference
2 Slight inbalance front brakes. Slight inbalance front brakes. 05 September 2008 [14:38] 05/09/2008 29 August 2008 [13:56] 29/08/2008 124089748216 124089748216 900152448212 900152448212
2 Slight binding n/s/front brake. Slight binding n/s/front brake. 05 September 2008 [14:38] 05/09/2008 29 August 2008 [13:56] 29/08/2008 124089748216 124089748216 900152448212 900152448212
1 Engine running poorly. Engine running poorly. 13 May 2015 [15:08] 13/05/2015 838713835163 838713835163
1 Passenger seat(s) missing at time of test Passenger seat(s) missing at time of test 13 March 2012 [12:38] 13/03/2012 676863772011 676863772011
1 Poss oil leak from o/s rear hub Poss oil leak from o/s rear hub 13 March 2012 [12:38] 13/03/2012 676863772011 676863772011

MOT TEST: 13 May 2015 15:08:27 FAILED
MOT TEST: 13 May 2015 15:08:27 FAILED

This test (838713835163) was completed on the 13 May 2015 15:08:27 and FAILED the requirements for a valid MOT with 15 comments.

This test (838713835163) was completed on the 13 May 2015 15:08:27 and FAILED the requirements for a valid MOT with 15 comments.

Recorded mileage: 41,999

Recorded mileage: 41,999


ADVISORY

FAIL

USER ENTERED


MOT TEST: 13 March 2012 12:38:49 PASSED
MOT TEST: 13 March 2012 12:38:49 PASSED

This test (676863772011) was completed on the 13 March 2012 12:38:49 and PASSED the requirements for a valid MOT with 3 comments.

This test (676863772011) was completed on the 13 March 2012 12:38:49 and PASSED the requirements for a valid MOT with 3 comments.

Recorded mileage: 41,842

Recorded mileage: 41,842


ADVISORY

USER ENTERED


MOT TEST: 24 August 2010 09:32:52 FAILED
MOT TEST: 24 August 2010 09:32:52 FAILED

This test (844766030282) was completed on the 24 August 2010 09:32:52 and FAILED the requirements for a valid MOT with 6 comments.

This test (844766030282) was completed on the 24 August 2010 09:32:52 and FAILED the requirements for a valid MOT with 6 comments.

Recorded mileage: 41,592

Recorded mileage: 41,592


FAIL


MOT TEST: 17 September 2009 14:35:53 PASSED
MOT TEST: 17 September 2009 14:35:53 PASSED

This test (531960269269) was completed on the 17 September 2009 14:35:53 and PASSED the requirements for a valid MOT with 0 comments.

This test (531960269269) was completed on the 17 September 2009 14:35:53 and PASSED the requirements for a valid MOT with 0 comments.

Recorded mileage: 40,094

Recorded mileage: 40,094


MOT TEST: 05 September 2008 14:38:27 PASSED
MOT TEST: 05 September 2008 14:38:27 PASSED

This test (124089748216) was completed on the 05 September 2008 14:38:27 and PASSED the requirements for a valid MOT with 2 comments.

This test (124089748216) was completed on the 05 September 2008 14:38:27 and PASSED the requirements for a valid MOT with 2 comments.

Recorded mileage: 39,126

Recorded mileage: 39,126


USER ENTERED


MOT TEST: 29 August 2008 13:56:51 FAILED
MOT TEST: 29 August 2008 13:56:51 FAILED

This test (900152448212) was completed on the 29 August 2008 13:56:51 and FAILED the requirements for a valid MOT with 7 comments.

This test (900152448212) was completed on the 29 August 2008 13:56:51 and FAILED the requirements for a valid MOT with 7 comments.

Recorded mileage: 39,120

Recorded mileage: 39,120


FAIL

USER ENTERED


MOT TEST: 17 August 2007 08:44:58 PASSED
MOT TEST: 17 August 2007 08:44:58 PASSED

This test (724339427203) was completed on the 17 August 2007 08:44:58 and PASSED the requirements for a valid MOT with 0 comments.

This test (724339427203) was completed on the 17 August 2007 08:44:58 and PASSED the requirements for a valid MOT with 0 comments.

Recorded mileage: 38,381

Recorded mileage: 38,381


MOT TEST: 14 August 2007 13:03:57 FAILED
MOT TEST: 14 August 2007 13:03:57 FAILED

This test (233896927221) was completed on the 14 August 2007 13:03:57 and FAILED the requirements for a valid MOT with 1 comments.

This test (233896927221) was completed on the 14 August 2007 13:03:57 and FAILED the requirements for a valid MOT with 1 comments.

Recorded mileage: 38,381

Recorded mileage: 38,381


FAIL


MOT TEST: 29 August 2006 16:30:21 PASSED
MOT TEST: 29 August 2006 16:30:21 PASSED

This test (523261746240) was completed on the 29 August 2006 16:30:21 and PASSED the requirements for a valid MOT with 0 comments.

This test (523261746240) was completed on the 29 August 2006 16:30:21 and PASSED the requirements for a valid MOT with 0 comments.

Recorded mileage: 37,547

Recorded mileage: 37,547


MOT TEST: 17 August 2006 11:58:20 FAILED
MOT TEST: 17 August 2006 11:58:20 FAILED

This test (242049726217) was completed on the 17 August 2006 11:58:20 and FAILED the requirements for a valid MOT with 4 comments.

This test (242049726217) was completed on the 17 August 2006 11:58:20 and FAILED the requirements for a valid MOT with 4 comments.

Recorded mileage: 37,508

Recorded mileage: 37,508


FAIL