627 UXW


627UXW is registered to a Black 1959, Morris Minor with a Petrol engine. It Failed its most recent MOT Test on the 30 May 2013

7 unique faults (7 Total) reported in its MOT History (8 Tests).

0 common/recurring faults.

75% (6) MOT Pass Rate and a 25% (2) MOT Failure Rate.

85,756 recorded miles.

627 UXW


627UXW is registered to a Black 1959, Morris Minor with a Petrol engine. It Failed its most recent MOT Test on the 30 May 2013

7 unique faults (7 Total) reported in its MOT History (8 Tests).

0 common/recurring faults.

75% (6) MOT Pass Rate and a 25% (2) MOT Failure Rate.

85,756 recorded miles.

MOT PASS/Failure rate for 627 UXW

all MOT test results for 627 UXW represented as a percentage
MOT PASS/Failure rate for 627 UXW
all MOT test results for 627 UXW represented as a percentage

PERCENTAGE OF VEHICLE FAULTS WITH 627 UXW

ALL REPORTED FAULTS, DISPLAYED BY PERCENTAGE OF OCCURRENCE DURING ALL MOT TESTS
PERCENTAGE OF VEHICLE FAULTS WITH 627 UXW
ALL REPORTED FAULTS, DISPLAYED BY PERCENTAGE OF OCCURRENCE DURING ALL MOT TESTS
FAIL

627 UXW annual Faults by type

ALL REPORTED FAULTS, DISPLAYED over time and categorised by type
627 UXW annual Faults by type
ALL REPORTED FAULTS, DISPLAYED over time and categorised by type

ALL 627 UXW Failure Faults [7]

ALL Failure faults, ORDERED by OCCURRENCE DURING 627 UXW's MOT HISTORY
ALL 627 UXW Failure Faults [7]
ALL Failure faults, ORDERED by OCCURRENCE DURING 627 UXW's MOT HISTORY
Fail Faults | source www.vehiclestats.co.uk
Fault Fault Test Date Test Date/Time Reference MOT Test Reference
1 Horn not working (1.6.2a) Horn not working (1.6.2a) 04 April 2007 [10:57] 04/04/2007 451404797054 451404797054
1 Fuel cap/sealing device sealing washer deteriorated (7.2.4c) Fuel cap/sealing device sealing washer deteriorated (7.2.4c) 04 April 2007 [10:57] 04/04/2007 451404797054 451404797054
1 Nearside front tyre tread depth below requirements of 1.6mm (4.1.e.1) Nearside front tyre tread depth below requirements of 1.6mm (4.1.e.1) 10 March 2006 [11:13] 10/03/2006 302319366085 302319366085
1 Offside front tyre tread depth below requirements of 1.6mm (4.1.e.1) Offside front tyre tread depth below requirements of 1.6mm (4.1.e.1) 10 March 2006 [11:13] 10/03/2006 302319366085 302319366085
1 Nearside front front wheel bearing has excessive play (2.5.a.3c) Nearside front front wheel bearing has excessive play (2.5.a.3c) 10 March 2006 [11:13] 10/03/2006 302319366085 302319366085
1 Parking brake: efficiency below requirements (3.7.b.7) Parking brake: efficiency below requirements (3.7.b.7) 10 March 2006 [11:13] 10/03/2006 302319366085 302319366085
1 Brakes imbalanced across an axle (3.7.b.5b) Brakes imbalanced across an axle (3.7.b.5b) 10 March 2006 [11:13] 10/03/2006 302319366085 302319366085

MOT TEST: 30 May 2013 12:21:39 PASSED
MOT TEST: 30 May 2013 12:21:39 PASSED

This test (305660253189) was completed on the 30 May 2013 12:21:39 and PASSED the requirements for a valid MOT with 0 comments.

This test (305660253189) was completed on the 30 May 2013 12:21:39 and PASSED the requirements for a valid MOT with 0 comments.

Recorded mileage: 85,756

Recorded mileage: 85,756


MOT TEST: 28 May 2012 15:36:38 PASSED
MOT TEST: 28 May 2012 15:36:38 PASSED

This test (296439942136) was completed on the 28 May 2012 15:36:38 and PASSED the requirements for a valid MOT with 0 comments.

This test (296439942136) was completed on the 28 May 2012 15:36:38 and PASSED the requirements for a valid MOT with 0 comments.

Recorded mileage: 85,752

Recorded mileage: 85,752


MOT TEST: 13 March 2009 15:31:39 PASSED
MOT TEST: 13 March 2009 15:31:39 PASSED

This test (781332579085) was completed on the 13 March 2009 15:31:39 and PASSED the requirements for a valid MOT with 0 comments.

This test (781332579085) was completed on the 13 March 2009 15:31:39 and PASSED the requirements for a valid MOT with 0 comments.

Recorded mileage: 85,256

Recorded mileage: 85,256


MOT TEST: 20 March 2008 15:10:16 PASSED
MOT TEST: 20 March 2008 15:10:16 PASSED

This test (423040288076) was completed on the 20 March 2008 15:10:16 and PASSED the requirements for a valid MOT with 0 comments.

This test (423040288076) was completed on the 20 March 2008 15:10:16 and PASSED the requirements for a valid MOT with 0 comments.

Recorded mileage: 84,269

Recorded mileage: 84,269


MOT TEST: 11 April 2007 12:05:10 PASSED
MOT TEST: 11 April 2007 12:05:10 PASSED

This test (450671607103) was completed on the 11 April 2007 12:05:10 and PASSED the requirements for a valid MOT with 0 comments.

This test (450671607103) was completed on the 11 April 2007 12:05:10 and PASSED the requirements for a valid MOT with 0 comments.

Recorded mileage: 84,091

Recorded mileage: 84,091


MOT TEST: 04 April 2007 10:57:19 FAILED
MOT TEST: 04 April 2007 10:57:19 FAILED

This test (451404797054) was completed on the 04 April 2007 10:57:19 and FAILED the requirements for a valid MOT with 2 comments.

This test (451404797054) was completed on the 04 April 2007 10:57:19 and FAILED the requirements for a valid MOT with 2 comments.

Recorded mileage: 84,074

Recorded mileage: 84,074


FAIL


MOT TEST: 22 March 2006 14:42:38 PASSED
MOT TEST: 22 March 2006 14:42:38 PASSED

This test (662481086089) was completed on the 22 March 2006 14:42:38 and PASSED the requirements for a valid MOT with 0 comments.

This test (662481086089) was completed on the 22 March 2006 14:42:38 and PASSED the requirements for a valid MOT with 0 comments.

Recorded mileage: 83,406

Recorded mileage: 83,406


MOT TEST: 10 March 2006 11:13:12 FAILED
MOT TEST: 10 March 2006 11:13:12 FAILED

This test (302319366085) was completed on the 10 March 2006 11:13:12 and FAILED the requirements for a valid MOT with 5 comments.

This test (302319366085) was completed on the 10 March 2006 11:13:12 and FAILED the requirements for a valid MOT with 5 comments.

Recorded mileage: 83,406

Recorded mileage: 83,406


FAIL