629 0PU


6290PU is registered to a Black 1960, Morris Minor with a Petrol engine. It Failed its most recent MOT Test on the 09 July 2007

8 unique faults (8 Total) reported in its MOT History (3 Tests).

0 common/recurring faults.

33% (1) MOT Pass Rate and a 67% (2) MOT Failure Rate.

20,640 recorded miles.

629 0PU


6290PU is registered to a Black 1960, Morris Minor with a Petrol engine. It Failed its most recent MOT Test on the 09 July 2007

8 unique faults (8 Total) reported in its MOT History (3 Tests).

0 common/recurring faults.

33% (1) MOT Pass Rate and a 67% (2) MOT Failure Rate.

20,640 recorded miles.

MOT PASS/Failure rate for 629 0PU

all MOT test results for 629 0PU represented as a percentage
MOT PASS/Failure rate for 629 0PU
all MOT test results for 629 0PU represented as a percentage

PERCENTAGE OF VEHICLE FAULTS WITH 629 0PU

ALL REPORTED FAULTS, DISPLAYED BY PERCENTAGE OF OCCURRENCE DURING ALL MOT TESTS
PERCENTAGE OF VEHICLE FAULTS WITH 629 0PU
ALL REPORTED FAULTS, DISPLAYED BY PERCENTAGE OF OCCURRENCE DURING ALL MOT TESTS
FAIL

629 0PU annual Faults by type

ALL REPORTED FAULTS, DISPLAYED over time and categorised by type
629 0PU annual Faults by type
ALL REPORTED FAULTS, DISPLAYED over time and categorised by type

ALL 629 0PU Failure Faults [8]

ALL Failure faults, ORDERED by OCCURRENCE DURING 629 0PU's MOT HISTORY
ALL 629 0PU Failure Faults [8]
ALL Failure faults, ORDERED by OCCURRENCE DURING 629 0PU's MOT HISTORY
Fail Faults | source www.vehiclestats.co.uk
Fault Fault Test Date Test Date/Time Reference MOT Test Reference
1 Offside front position lamp(s) not working (1.1.a.3b) Offside front position lamp(s) not working (1.1.a.3b) 09 July 2007 [14:58] 09/07/2007 763120897126 763120897126
1 Offside front tyre tread depth below requirements of 1.6mm (4.1.e.1) Offside front tyre tread depth below requirements of 1.6mm (4.1.e.1) 09 July 2007 [14:58] 09/07/2007 763120897126 763120897126
1 Nearside rear suspension spring mounting prescribed area is excessively corroded (2.4.a.3) Nearside rear suspension spring mounting prescribed area is excessively corroded (2.4.a.3) 09 July 2007 [14:58] 09/07/2007 763120897126 763120897126
1 Nearside rear brake recording little or no effort (3.7.b.5a) Nearside rear brake recording little or no effort (3.7.b.5a) 09 July 2007 [14:58] 09/07/2007 763120897126 763120897126
1 Nearside rear parking brake recording little or no effort (3.7.b.6a) Nearside rear parking brake recording little or no effort (3.7.b.6a) 09 July 2007 [14:58] 09/07/2007 763120897126 763120897126
1 Service brake: efficiency below requirements (3.7.b.7) Service brake: efficiency below requirements (3.7.b.7) 09 July 2007 [14:58] 09/07/2007 763120897126 763120897126
1 Parking brake: efficiency below requirements (3.7.b.7) Parking brake: efficiency below requirements (3.7.b.7) 09 July 2007 [14:58] 09/07/2007 763120897126 763120897126
1 Offside rear tyre tread depth below requirements of 1.6mm (4.1.e.1) Offside rear tyre tread depth below requirements of 1.6mm (4.1.e.1) 11 July 2006 [11:37] 11/07/2006 290082196117 290082196117

MOT TEST: 09 July 2007 14:58:27 FAILED
MOT TEST: 09 July 2007 14:58:27 FAILED

This test (763120897126) was completed on the 09 July 2007 14:58:27 and FAILED the requirements for a valid MOT with 7 comments.

This test (763120897126) was completed on the 09 July 2007 14:58:27 and FAILED the requirements for a valid MOT with 7 comments.

Recorded mileage: 20,640

Recorded mileage: 20,640


FAIL


MOT TEST: 11 July 2006 14:59:05 PASSED
MOT TEST: 11 July 2006 14:59:05 PASSED

This test (203762696425) was completed on the 11 July 2006 14:59:05 and PASSED the requirements for a valid MOT with 0 comments.

This test (203762696425) was completed on the 11 July 2006 14:59:05 and PASSED the requirements for a valid MOT with 0 comments.

Recorded mileage: 15,247

Recorded mileage: 15,247


MOT TEST: 11 July 2006 11:37:18 FAILED
MOT TEST: 11 July 2006 11:37:18 FAILED

This test (290082196117) was completed on the 11 July 2006 11:37:18 and FAILED the requirements for a valid MOT with 1 comments.

This test (290082196117) was completed on the 11 July 2006 11:37:18 and FAILED the requirements for a valid MOT with 1 comments.

Recorded mileage: 15,234

Recorded mileage: 15,234


FAIL