629 YKN


629YKN is registered to a Green 1963, Morris Minor 1000 with a Petrol engine. It Failed its most recent MOT Test on the 04 July 2017

32 unique faults (39 Total) reported in its MOT History (7 Tests).

7 common/recurring faults, the most frequent (2 times) is: Fuel cap seal deteriorated.

57% (4) MOT Pass Rate and a 43% (3) MOT Failure Rate.

34,340 recorded miles.

629 YKN


629YKN is registered to a Green 1963, Morris Minor 1000 with a Petrol engine. It Failed its most recent MOT Test on the 04 July 2017

32 unique faults (39 Total) reported in its MOT History (7 Tests).

7 common/recurring faults, the most frequent (2 times) is: Fuel cap seal deteriorated.

57% (4) MOT Pass Rate and a 43% (3) MOT Failure Rate.

34,340 recorded miles.

MOT PASS/Failure rate for 629 YKN

all MOT test results for 629 YKN represented as a percentage
MOT PASS/Failure rate for 629 YKN
all MOT test results for 629 YKN represented as a percentage

PERCENTAGE OF VEHICLE FAULTS WITH 629 YKN

ALL REPORTED FAULTS, DISPLAYED BY PERCENTAGE OF OCCURRENCE DURING ALL MOT TESTS
PERCENTAGE OF VEHICLE FAULTS WITH 629 YKN
ALL REPORTED FAULTS, DISPLAYED BY PERCENTAGE OF OCCURRENCE DURING ALL MOT TESTS
ADVISORY

FAIL

USER ENTERED

629 YKN annual Faults by type

ALL REPORTED FAULTS, DISPLAYED over time and categorised by type
629 YKN annual Faults by type
ALL REPORTED FAULTS, DISPLAYED over time and categorised by type

RECURRING FAULTS WITH 629 YKN

FAULTS THAT HAVE OCCURED MORE THAN ONCE DURING 629 YKN's MOT HISTORY
RECURRING FAULTS WITH 629 YKN
FAULTS THAT HAVE OCCURED MORE THAN ONCE DURING 629 YKN's MOT HISTORY
Fault Fault Test Date Test Date/Time Reference MOT Test Reference
2 Fuel cap seal deteriorated Fuel cap seal deteriorated 04 July 2017 [12:26] 04/07/2017 03 July 2017 [15:28] 03/07/2017 110053620657 110053620657 439887122439 439887122439
2 Rear seats removed Rear seats removed 04 July 2017 [12:26] 04/07/2017 03 July 2017 [15:28] 03/07/2017 110053620657 110053620657 439887122439 439887122439
2 Exhaust back box slight blow Exhaust back box slight blow 04 July 2017 [12:26] 04/07/2017 03 July 2017 [15:28] 03/07/2017 110053620657 110053620657 439887122439 439887122439
2 General underside welding general corrosion General underside welding general corrosion 05 July 2016 [13:46] 05/07/2016 22 June 2016 [09:31] 22/06/2016 815692118612 815692118612 209900370620 209900370620
2 Play in column bushes Play in column bushes 05 July 2016 [13:46] 05/07/2016 22 June 2016 [09:31] 22/06/2016 815692118612 815692118612 209900370620 209900370620
2 Nearside rear position lamp(s) adversely affected by the operation of another lamp (1.1.a.3f) Nearside rear position lamp(s) adversely affected by the operation of another lamp (1.1.a.3f) 22 June 2016 [09:31] 22/06/2016 16 January 2012 [15:25] 16/01/2012 209900370620 209900370620 377276912037 377276912037
2 Floor heavaly plated Floor heavaly plated 24 January 2012 [15:16] 24/01/2012 16 January 2012 [15:25] 16/01/2012 188964622460 188964622460 377276912037 377276912037

ALL 629 YKN ADVISORIES [11]

ALL ADVISORIES, ORDERED by OCCURRENCE DURING 629 YKN's MOT HISTORY
ALL 629 YKN ADVISORIES [11]
ALL ADVISORIES, ORDERED by OCCURRENCE DURING 629 YKN's MOT HISTORY
Advisory Faults | source www.vehiclestats.co.uk
Fault Fault Test Date Test Date/Time Reference MOT Test Reference
2 Fuel cap seal deteriorated Fuel cap seal deteriorated 04 July 2017 [12:26] 04/07/2017 03 July 2017 [15:28] 03/07/2017 110053620657 110053620657 439887122439 439887122439
2 Rear seats removed Rear seats removed 04 July 2017 [12:26] 04/07/2017 03 July 2017 [15:28] 03/07/2017 110053620657 110053620657 439887122439 439887122439
2 Exhaust back box slight blow Exhaust back box slight blow 04 July 2017 [12:26] 04/07/2017 03 July 2017 [15:28] 03/07/2017 110053620657 110053620657 439887122439 439887122439
2 General underside welding general corrosion General underside welding general corrosion 05 July 2016 [13:46] 05/07/2016 22 June 2016 [09:31] 22/06/2016 815692118612 815692118612 209900370620 209900370620
2 Play in column bushes Play in column bushes 05 July 2016 [13:46] 05/07/2016 22 June 2016 [09:31] 22/06/2016 815692118612 815692118612 209900370620 209900370620
1 Boot lid home made device to secure closed Boot lid home made device to secure closed 22 June 2016 [09:31] 22/06/2016 209900370620 209900370620

ALL 629 YKN Failure Faults [23]

ALL Failure faults, ORDERED by OCCURRENCE DURING 629 YKN's MOT HISTORY
ALL 629 YKN Failure Faults [23]
ALL Failure faults, ORDERED by OCCURRENCE DURING 629 YKN's MOT HISTORY
Fail Faults | source www.vehiclestats.co.uk
Fault Fault Test Date Test Date/Time Reference MOT Test Reference
2 Nearside rear position lamp(s) adversely affected by the operation of another lamp (1.1.a.3f) Nearside rear position lamp(s) adversely affected by the operation of another lamp (1.1.a.3f) 22 June 2016 [09:31] 22/06/2016 16 January 2012 [15:25] 16/01/2012 209900370620 209900370620 377276912037 377276912037
1 Nearside front tyre has ply or cords exposed (4.1.d.1b) Nearside front tyre has ply or cords exposed (4.1.d.1b) 03 July 2017 [15:28] 03/07/2017 439887122439 439887122439
1 Nearside rear tyre has a cut in excess of the requirements deep enough to reach the ply or cords (4.1.d.1a) Nearside rear tyre has a cut in excess of the requirements deep enough to reach the ply or cords (4.1.d.1a) 03 July 2017 [15:28] 03/07/2017 439887122439 439887122439
1 Nearside suspension component mounting prescribed area is fractured rear torsion bar mount cross member (2.4.a.3) Nearside suspension component mounting prescribed area is fractured rear torsion bar mount cross member (2.4.a.3) 22 June 2016 [09:31] 22/06/2016 209900370620 209900370620
1 Nearside suspension component mounting prescribed area is excessively corroded cross member to sill (2.4.a.3) Nearside suspension component mounting prescribed area is excessively corroded cross member to sill (2.4.a.3) 22 June 2016 [09:31] 22/06/2016 209900370620 209900370620
1 Rear parking brake recording little or no effort (3.7.d.3a) Rear parking brake recording little or no effort (3.7.d.3a) 22 June 2016 [09:31] 22/06/2016 209900370620 209900370620
1 Nearside rear brakes imbalanced across an axle (3.7.b.5b) Nearside rear brakes imbalanced across an axle (3.7.b.5b) 22 June 2016 [09:31] 22/06/2016 209900370620 209900370620
1 Nearside headlamp aim too high (1.8) Nearside headlamp aim too high (1.8) 22 June 2016 [09:31] 22/06/2016 209900370620 209900370620
1 Headlamp aim too low (1.8) Headlamp aim too low (1.8) 22 June 2016 [09:31] 22/06/2016 209900370620 209900370620
1 Nearside rear stop lamp not working (1.2.1b) Nearside rear stop lamp not working (1.2.1b) 16 January 2012 [15:25] 16/01/2012 377276912037 377276912037
1 Tyre(s) incorrect because cross-ply or bias-belted tyres are fitted on the rear axle and radial-ply tyres are fitted on the front axle. (4.1.a.2b) Tyre(s) incorrect because cross-ply or bias-belted tyres are fitted on the rear axle and radial-ply tyres are fitted on the front axle. (4.1.a.2b) 16 January 2012 [15:25] 16/01/2012 377276912037 377276912037
1 Nearside rear tyre has a tear, caused by separation or partial failure of its structure (4.1.d.1b) Nearside rear tyre has a tear, caused by separation or partial failure of its structure (4.1.d.1b) 16 January 2012 [15:25] 16/01/2012 377276912037 377276912037
1 Offside rear tyre has a tear, caused by separation or partial failure of its structure (4.1.d.1b) Offside rear tyre has a tear, caused by separation or partial failure of its structure (4.1.d.1b) 16 January 2012 [15:25] 16/01/2012 377276912037 377276912037
1 Nearside rear wheel nut(s) loose (4.2.a.1e) Nearside rear wheel nut(s) loose (4.2.a.1e) 16 January 2012 [15:25] 16/01/2012 377276912037 377276912037
1 Upper obligatory mirror insecure (8.1.1) Upper obligatory mirror insecure (8.1.1) 16 January 2012 [15:25] 16/01/2012 377276912037 377276912037
1 Nearside front suspension has excessive play in a track control arm inner bush (2.5.b.2b) Nearside front suspension has excessive play in a track control arm inner bush (2.5.b.2b) 16 January 2012 [15:25] 16/01/2012 377276912037 377276912037
1 Nearside rear body or chassis has an inadequate repair, seriously affecting its strength within 30cm of the body mountings (6.1.b.2) Nearside rear body or chassis has an inadequate repair, seriously affecting its strength within 30cm of the body mountings (6.1.b.2) 16 January 2012 [15:25] 16/01/2012 377276912037 377276912037
1 Offside front body or chassis has an inadequate repair, seriously affecting its strength within 30cm of the body mountings (6.1.b.2) Offside front body or chassis has an inadequate repair, seriously affecting its strength within 30cm of the body mountings (6.1.b.2) 16 January 2012 [15:25] 16/01/2012 377276912037 377276912037
1 Nearside windscreen wiper does not clear the windscreen effectively (8.2.2) Nearside windscreen wiper does not clear the windscreen effectively (8.2.2) 16 January 2012 [15:25] 16/01/2012 377276912037 377276912037
1 Offside windscreen wiper does not clear the windscreen effectively (8.2.2) Offside windscreen wiper does not clear the windscreen effectively (8.2.2) 16 January 2012 [15:25] 16/01/2012 377276912037 377276912037
1 Service brake: efficiency below requirements (3.7.b.7) Service brake: efficiency below requirements (3.7.b.7) 16 January 2012 [15:25] 16/01/2012 377276912037 377276912037
1 Parking brake: efficiency below requirements (3.7.b.7) Parking brake: efficiency below requirements (3.7.b.7) 16 January 2012 [15:25] 16/01/2012 377276912037 377276912037

ALL 629 YKN User Entered Faults [5]

ALL User Entered faults, ORDERED by OCCURRENCE DURING 629 YKN's MOT HISTORY
ALL 629 YKN User Entered Faults [5]
ALL User Entered faults, ORDERED by OCCURRENCE DURING 629 YKN's MOT HISTORY
User Entered Faults | source www.vehiclestats.co.uk
Fault Fault Test Date Test Date/Time Reference MOT Test Reference
2 Floor heavaly plated Floor heavaly plated 24 January 2012 [15:16] 24/01/2012 16 January 2012 [15:25] 16/01/2012 188964622460 188964622460 377276912037 377276912037
1 Etensive welding to vehicle structure Etensive welding to vehicle structure 06 August 2013 [16:19] 06/08/2013 616528313298 616528313298
1 All tyers badly cracking All tyers badly cracking 16 January 2012 [15:25] 16/01/2012 377276912037 377276912037
1 Speedo glass cracked Speedo glass cracked 16 January 2012 [15:25] 16/01/2012 377276912037 377276912037

MOT TEST: 04 July 2017 12:26:42 PASSED
MOT TEST: 04 July 2017 12:26:42 PASSED

This test (110053620657) was completed on the 04 July 2017 12:26:42 and PASSED the requirements for a valid MOT with 3 comments.

This test (110053620657) was completed on the 04 July 2017 12:26:42 and PASSED the requirements for a valid MOT with 3 comments.

Recorded mileage: 31,365

Recorded mileage: 31,365


ADVISORY


MOT TEST: 03 July 2017 15:28:44 FAILED
MOT TEST: 03 July 2017 15:28:44 FAILED

This test (439887122439) was completed on the 03 July 2017 15:28:44 and FAILED the requirements for a valid MOT with 5 comments.

This test (439887122439) was completed on the 03 July 2017 15:28:44 and FAILED the requirements for a valid MOT with 5 comments.

Recorded mileage: 31,365

Recorded mileage: 31,365


ADVISORY

FAIL


MOT TEST: 05 July 2016 13:46:06 PASSED
MOT TEST: 05 July 2016 13:46:06 PASSED

This test (815692118612) was completed on the 05 July 2016 13:46:06 and PASSED the requirements for a valid MOT with 2 comments.

This test (815692118612) was completed on the 05 July 2016 13:46:06 and PASSED the requirements for a valid MOT with 2 comments.

Recorded mileage: 31,360

Recorded mileage: 31,360


ADVISORY


MOT TEST: 22 June 2016 09:31:09 FAILED
MOT TEST: 22 June 2016 09:31:09 FAILED

This test (209900370620) was completed on the 22 June 2016 09:31:09 and FAILED the requirements for a valid MOT with 10 comments.

This test (209900370620) was completed on the 22 June 2016 09:31:09 and FAILED the requirements for a valid MOT with 10 comments.

Recorded mileage: 31,358

Recorded mileage: 31,358


ADVISORY

FAIL


MOT TEST: 06 August 2013 16:19:26 PASSED
MOT TEST: 06 August 2013 16:19:26 PASSED

This test (616528313298) was completed on the 06 August 2013 16:19:26 and PASSED the requirements for a valid MOT with 1 comments.

This test (616528313298) was completed on the 06 August 2013 16:19:26 and PASSED the requirements for a valid MOT with 1 comments.

Recorded mileage: 34,340

Recorded mileage: 34,340


USER ENTERED


MOT TEST: 24 January 2012 15:16:16 PASSED
MOT TEST: 24 January 2012 15:16:16 PASSED

This test (188964622460) was completed on the 24 January 2012 15:16:16 and PASSED the requirements for a valid MOT with 1 comments.

This test (188964622460) was completed on the 24 January 2012 15:16:16 and PASSED the requirements for a valid MOT with 1 comments.

Recorded mileage: 30,943

Recorded mileage: 30,943


USER ENTERED


MOT TEST: 16 January 2012 15:25:45 FAILED
MOT TEST: 16 January 2012 15:25:45 FAILED

This test (377276912037) was completed on the 16 January 2012 15:25:45 and FAILED the requirements for a valid MOT with 17 comments.

This test (377276912037) was completed on the 16 January 2012 15:25:45 and FAILED the requirements for a valid MOT with 17 comments.

Recorded mileage: 30,932

Recorded mileage: 30,932


FAIL

USER ENTERED