631 NDV


631NDV is registered to a Green 1963, Morris Mini with a Petrol engine. It Failed its most recent MOT Test on the 13 November 2017

6 unique faults (9 Total) reported in its MOT History (5 Tests).

3 common/recurring faults, the most frequent (2 times) is: Parking brake: efficiency below requirements (3.7.C.1b).

60% (3) MOT Pass Rate and a 40% (2) MOT Failure Rate.

18,857 recorded miles.

631 NDV


631NDV is registered to a Green 1963, Morris Mini with a Petrol engine. It Failed its most recent MOT Test on the 13 November 2017

6 unique faults (9 Total) reported in its MOT History (5 Tests).

3 common/recurring faults, the most frequent (2 times) is: Parking brake: efficiency below requirements (3.7.C.1b).

60% (3) MOT Pass Rate and a 40% (2) MOT Failure Rate.

18,857 recorded miles.

MOT PASS/Failure rate for 631 NDV

all MOT test results for 631 NDV represented as a percentage
MOT PASS/Failure rate for 631 NDV
all MOT test results for 631 NDV represented as a percentage

PERCENTAGE OF VEHICLE FAULTS WITH 631 NDV

ALL REPORTED FAULTS, DISPLAYED BY PERCENTAGE OF OCCURRENCE DURING ALL MOT TESTS
PERCENTAGE OF VEHICLE FAULTS WITH 631 NDV
ALL REPORTED FAULTS, DISPLAYED BY PERCENTAGE OF OCCURRENCE DURING ALL MOT TESTS
ADVISORY

FAIL

631 NDV annual Faults by type

ALL REPORTED FAULTS, DISPLAYED over time and categorised by type
631 NDV annual Faults by type
ALL REPORTED FAULTS, DISPLAYED over time and categorised by type

RECURRING FAULTS WITH 631 NDV

FAULTS THAT HAVE OCCURED MORE THAN ONCE DURING 631 NDV's MOT HISTORY
RECURRING FAULTS WITH 631 NDV
FAULTS THAT HAVE OCCURED MORE THAN ONCE DURING 631 NDV's MOT HISTORY
Fault Fault Test Date Test Date/Time Reference MOT Test Reference
2 Parking brake: efficiency below requirements (3.7.c.1b) Parking brake: efficiency below requirements (3.7.c.1b) 10 November 2017 [16:54] 10/11/2017 14 October 2008 [16:54] 14/10/2008 894757445201 894757445201 850668388206 850668388206
2 Front exhaust has a minor leak of exhaust gases (7.1.2) Front exhaust has a minor leak of exhaust gases (7.1.2) 23 October 2008 [16:14] 23/10/2008 14 October 2008 [16:54] 14/10/2008 184047398275 184047398275 850668388206 850668388206
2 Steering system has slight free play detected at steering wheel (2.2.a.1b) Steering system has slight free play detected at steering wheel (2.2.a.1b) 23 October 2008 [16:14] 23/10/2008 14 October 2008 [16:54] 14/10/2008 184047398275 184047398275 850668388206 850668388206

ALL 631 NDV ADVISORIES [4]

ALL ADVISORIES, ORDERED by OCCURRENCE DURING 631 NDV's MOT HISTORY
ALL 631 NDV ADVISORIES [4]
ALL ADVISORIES, ORDERED by OCCURRENCE DURING 631 NDV's MOT HISTORY
Advisory Faults | source www.vehiclestats.co.uk
Fault Fault Test Date Test Date/Time Reference MOT Test Reference
2 Front exhaust has a minor leak of exhaust gases (7.1.2) Front exhaust has a minor leak of exhaust gases (7.1.2) 23 October 2008 [16:14] 23/10/2008 14 October 2008 [16:54] 14/10/2008 184047398275 184047398275 850668388206 850668388206
2 Steering system has slight free play detected at steering wheel (2.2.a.1b) Steering system has slight free play detected at steering wheel (2.2.a.1b) 23 October 2008 [16:14] 23/10/2008 14 October 2008 [16:54] 14/10/2008 184047398275 184047398275 850668388206 850668388206

ALL 631 NDV Failure Faults [5]

ALL Failure faults, ORDERED by OCCURRENCE DURING 631 NDV's MOT HISTORY
ALL 631 NDV Failure Faults [5]
ALL Failure faults, ORDERED by OCCURRENCE DURING 631 NDV's MOT HISTORY
Fail Faults | source www.vehiclestats.co.uk
Fault Fault Test Date Test Date/Time Reference MOT Test Reference
2 Parking brake: efficiency below requirements (3.7.c.1b) Parking brake: efficiency below requirements (3.7.c.1b) 10 November 2017 [16:54] 10/11/2017 14 October 2008 [16:54] 14/10/2008 894757445201 894757445201 850668388206 850668388206
1 Service brake: efficiency below requirements (3.7.c.1a) Service brake: efficiency below requirements (3.7.c.1a) 10 November 2017 [16:54] 10/11/2017 894757445201 894757445201
1 Offside rear direction indicator incorrect colour (1.4.a.2f) Offside rear direction indicator incorrect colour (1.4.a.2f) 14 October 2008 [16:54] 14/10/2008 850668388206 850668388206
1 Indicator tell tale missing (1.4.a.2a) Indicator tell tale missing (1.4.a.2a) 14 October 2008 [16:54] 14/10/2008 850668388206 850668388206

MOT TEST: 13 November 2017 12:57:42 PASSED
MOT TEST: 13 November 2017 12:57:42 PASSED

This test (291084899679) was completed on the 13 November 2017 12:57:42 and PASSED the requirements for a valid MOT with 0 comments.

This test (291084899679) was completed on the 13 November 2017 12:57:42 and PASSED the requirements for a valid MOT with 0 comments.

Recorded mileage: 18,857

Recorded mileage: 18,857


MOT TEST: 10 November 2017 16:54:23 FAILED
MOT TEST: 10 November 2017 16:54:23 FAILED

This test (894757445201) was completed on the 10 November 2017 16:54:23 and FAILED the requirements for a valid MOT with 2 comments.

This test (894757445201) was completed on the 10 November 2017 16:54:23 and FAILED the requirements for a valid MOT with 2 comments.

Recorded mileage: 18,857

Recorded mileage: 18,857


FAIL


MOT TEST: 06 October 2009 17:01:47 PASSED
MOT TEST: 06 October 2009 17:01:47 PASSED

This test (342129179457) was completed on the 06 October 2009 17:01:47 and PASSED the requirements for a valid MOT with 0 comments.

This test (342129179457) was completed on the 06 October 2009 17:01:47 and PASSED the requirements for a valid MOT with 0 comments.

Recorded mileage: 18,760

Recorded mileage: 18,760


MOT TEST: 23 October 2008 16:14:28 PASSED
MOT TEST: 23 October 2008 16:14:28 PASSED

This test (184047398275) was completed on the 23 October 2008 16:14:28 and PASSED the requirements for a valid MOT with 2 comments.

This test (184047398275) was completed on the 23 October 2008 16:14:28 and PASSED the requirements for a valid MOT with 2 comments.

Recorded mileage: 18,646

Recorded mileage: 18,646


ADVISORY


MOT TEST: 14 October 2008 16:54:30 FAILED
MOT TEST: 14 October 2008 16:54:30 FAILED

This test (850668388206) was completed on the 14 October 2008 16:54:30 and FAILED the requirements for a valid MOT with 5 comments.

This test (850668388206) was completed on the 14 October 2008 16:54:30 and FAILED the requirements for a valid MOT with 5 comments.

Recorded mileage: 18,638

Recorded mileage: 18,638


ADVISORY

FAIL