631 ULG


631ULG is registered to a Grey 1962, Morris Minor 1000 with a Petrol engine. It Failed its most recent MOT Test on the 28 April 2017

3 unique faults (3 Total) reported in its MOT History (5 Tests).

0 common/recurring faults.

80% (4) MOT Pass Rate and a 20% (1) MOT Failure Rate.

24,965 recorded miles.

631 ULG


631ULG is registered to a Grey 1962, Morris Minor 1000 with a Petrol engine. It Failed its most recent MOT Test on the 28 April 2017

3 unique faults (3 Total) reported in its MOT History (5 Tests).

0 common/recurring faults.

80% (4) MOT Pass Rate and a 20% (1) MOT Failure Rate.

24,965 recorded miles.

MOT PASS/Failure rate for 631 ULG

all MOT test results for 631 ULG represented as a percentage
MOT PASS/Failure rate for 631 ULG
all MOT test results for 631 ULG represented as a percentage

PERCENTAGE OF VEHICLE FAULTS WITH 631 ULG

ALL REPORTED FAULTS, DISPLAYED BY PERCENTAGE OF OCCURRENCE DURING ALL MOT TESTS
PERCENTAGE OF VEHICLE FAULTS WITH 631 ULG
ALL REPORTED FAULTS, DISPLAYED BY PERCENTAGE OF OCCURRENCE DURING ALL MOT TESTS
FAIL

631 ULG annual Faults by type

ALL REPORTED FAULTS, DISPLAYED over time and categorised by type
631 ULG annual Faults by type
ALL REPORTED FAULTS, DISPLAYED over time and categorised by type

ALL 631 ULG Failure Faults [3]

ALL Failure faults, ORDERED by OCCURRENCE DURING 631 ULG's MOT HISTORY
ALL 631 ULG Failure Faults [3]
ALL Failure faults, ORDERED by OCCURRENCE DURING 631 ULG's MOT HISTORY
Fail Faults | source www.vehiclestats.co.uk
Fault Fault Test Date Test Date/Time Reference MOT Test Reference
1 Rear exhaust has a major leak of exhaust gases (7.1.2) Rear exhaust has a major leak of exhaust gases (7.1.2) 06 October 2008 [16:04] 06/10/2008 573410288255 573410288255
1 Windscreen washer provides insufficient washer liquid (8.2.3) Windscreen washer provides insufficient washer liquid (8.2.3) 06 October 2008 [16:04] 06/10/2008 573410288255 573410288255
1 Offside rear body or chassis has excessive corrosion, seriously affecting its strength within 30cm of the body mountings (6.1.b.2) Offside rear body or chassis has excessive corrosion, seriously affecting its strength within 30cm of the body mountings (6.1.b.2) 06 October 2008 [16:04] 06/10/2008 573410288255 573410288255

MOT TEST: 28 April 2017 08:11:48 PASSED
MOT TEST: 28 April 2017 08:11:48 PASSED

This test (172398940267) was completed on the 28 April 2017 08:11:48 and PASSED the requirements for a valid MOT with 0 comments.

This test (172398940267) was completed on the 28 April 2017 08:11:48 and PASSED the requirements for a valid MOT with 0 comments.

Recorded mileage: 24,965

Recorded mileage: 24,965


MOT TEST: 21 October 2015 08:14:43 PASSED
MOT TEST: 21 October 2015 08:14:43 PASSED

This test (355210112994) was completed on the 21 October 2015 08:14:43 and PASSED the requirements for a valid MOT with 0 comments.

This test (355210112994) was completed on the 21 October 2015 08:14:43 and PASSED the requirements for a valid MOT with 0 comments.

Recorded mileage: 24,850

Recorded mileage: 24,850


MOT TEST: 28 October 2014 11:45:16 PASSED
MOT TEST: 28 October 2014 11:45:16 PASSED

This test (859441504372) was completed on the 28 October 2014 11:45:16 and PASSED the requirements for a valid MOT with 0 comments.

This test (859441504372) was completed on the 28 October 2014 11:45:16 and PASSED the requirements for a valid MOT with 0 comments.

Recorded mileage: 24,542

Recorded mileage: 24,542


MOT TEST: 07 October 2008 13:25:19 PASSED
MOT TEST: 07 October 2008 13:25:19 PASSED

This test (174641588295) was completed on the 07 October 2008 13:25:19 and PASSED the requirements for a valid MOT with 0 comments.

This test (174641588295) was completed on the 07 October 2008 13:25:19 and PASSED the requirements for a valid MOT with 0 comments.

Recorded mileage: 24,202

Recorded mileage: 24,202


MOT TEST: 06 October 2008 16:04:28 FAILED
MOT TEST: 06 October 2008 16:04:28 FAILED

This test (573410288255) was completed on the 06 October 2008 16:04:28 and FAILED the requirements for a valid MOT with 3 comments.

This test (573410288255) was completed on the 06 October 2008 16:04:28 and FAILED the requirements for a valid MOT with 3 comments.

Recorded mileage: 24,202

Recorded mileage: 24,202


FAIL