634 XUT


634XUT is registered to a White 1960, Morris Minor 1000 with a Petrol engine. It Passed its most recent MOT Test on the 08 May 2019

20 unique faults (22 Total) reported in its MOT History (17 Tests).

2 common/recurring faults, the most frequent (2 times) is: Offside Front Suspension component mounting prescribed area is excessively corroded (2.4.A.3).

59% (10) MOT Pass Rate and a 41% (7) MOT Failure Rate.

7,956 recorded miles.

634 XUT


634XUT is registered to a White 1960, Morris Minor 1000 with a Petrol engine. It Passed its most recent MOT Test on the 08 May 2019

20 unique faults (22 Total) reported in its MOT History (17 Tests).

2 common/recurring faults, the most frequent (2 times) is: Offside Front Suspension component mounting prescribed area is excessively corroded (2.4.A.3).

59% (10) MOT Pass Rate and a 41% (7) MOT Failure Rate.

7,956 recorded miles.

MOT PASS/Failure rate for 634 XUT

all MOT test results for 634 XUT represented as a percentage
MOT PASS/Failure rate for 634 XUT
all MOT test results for 634 XUT represented as a percentage

PERCENTAGE OF VEHICLE FAULTS WITH 634 XUT

ALL REPORTED FAULTS, DISPLAYED BY PERCENTAGE OF OCCURRENCE DURING ALL MOT TESTS
PERCENTAGE OF VEHICLE FAULTS WITH 634 XUT
ALL REPORTED FAULTS, DISPLAYED BY PERCENTAGE OF OCCURRENCE DURING ALL MOT TESTS
ADVISORY

FAIL

USER ENTERED

PASS WITH RECTIFICATION

634 XUT annual Faults by type

ALL REPORTED FAULTS, DISPLAYED over time and categorised by type
634 XUT annual Faults by type
ALL REPORTED FAULTS, DISPLAYED over time and categorised by type

RECURRING FAULTS WITH 634 XUT

FAULTS THAT HAVE OCCURED MORE THAN ONCE DURING 634 XUT's MOT HISTORY
RECURRING FAULTS WITH 634 XUT
FAULTS THAT HAVE OCCURED MORE THAN ONCE DURING 634 XUT's MOT HISTORY
Fault Fault Test Date Test Date/Time Reference MOT Test Reference
2 Offside front suspension component mounting prescribed area is excessively corroded (2.4.a.3) Offside front suspension component mounting prescribed area is excessively corroded (2.4.a.3) 25 March 2013 [16:30] 25/03/2013 26 March 2012 [08:47] 26/03/2012 598334083030 598334083030 688596982085 688596982085
2 Nearside rear brake has slightly restricted free movement Nearside rear brake has slightly restricted free movement 31 March 2011 [16:51] 31/03/2011 31 March 2011 [09:31] 31/03/2011 655980891016 655980891016 967480491080 967480491080

ALL 634 XUT ADVISORIES [1]

ALL ADVISORIES, ORDERED by OCCURRENCE DURING 634 XUT's MOT HISTORY
ALL 634 XUT ADVISORIES [1]
ALL ADVISORIES, ORDERED by OCCURRENCE DURING 634 XUT's MOT HISTORY
Advisory Faults | source www.vehiclestats.co.uk
Fault Fault Test Date Test Date/Time Reference MOT Test Reference
1 All brakes binding slightly All brakes binding slightly 25 January 2018 [13:03] 25/01/2018 360378781324 360378781324

ALL 634 XUT Failure Faults [17]

ALL Failure faults, ORDERED by OCCURRENCE DURING 634 XUT's MOT HISTORY
ALL 634 XUT Failure Faults [17]
ALL Failure faults, ORDERED by OCCURRENCE DURING 634 XUT's MOT HISTORY
Fail Faults | source www.vehiclestats.co.uk
Fault Fault Test Date Test Date/Time Reference MOT Test Reference
1 Offside headlamp not working on dipped beam (4.1.1 (a) (ii)) Offside headlamp not working on dipped beam (4.1.1 (a) (ii)) 08 May 2019 [11:42] 08/05/2019 970111038116 970111038116
1 Fuel pipe leaking at pump (6.1.3 (b) (i)) Fuel pipe leaking at pump (6.1.3 (b) (i)) 08 May 2019 [11:42] 08/05/2019 970111038116 970111038116
1 Brakes imbalanced across an axle by more than 50% (1.2.1 (b) (ii)) Brakes imbalanced across an axle by more than 50% (1.2.1 (b) (ii)) 08 May 2019 [11:42] 08/05/2019 970111038116 970111038116
1 Front brake application uneven (3.7.b.2) Front brake application uneven (3.7.b.2) 30 January 2017 [12:34] 30/01/2017 554161894182 554161894182
1 Brake pedal spongy (3.3.b.1b) Brake pedal spongy (3.3.b.1b) 14 March 2014 [09:17] 14/03/2014 125223174032 125223174032
1 Offside front position lamp(s) not working (1.1.a.3b) Offside front position lamp(s) not working (1.1.a.3b) 14 March 2014 [09:17] 14/03/2014 125223174032 125223174032
1 Offside headlamp not working on dipped beam (1.7.5a) Offside headlamp not working on dipped beam (1.7.5a) 14 March 2014 [09:17] 14/03/2014 125223174032 125223174032
1 Offside headlamp not working on main beam (1.7.5a) Offside headlamp not working on main beam (1.7.5a) 14 March 2014 [09:17] 14/03/2014 125223174032 125223174032
1 Brake pedal anti-slip provision missing (3.3.a.1b) Brake pedal anti-slip provision missing (3.3.a.1b) 14 March 2014 [09:17] 14/03/2014 125223174032 125223174032
1 Nearside windscreen wiper does not clear the windscreen effectively (8.2.2) Nearside windscreen wiper does not clear the windscreen effectively (8.2.2) 14 March 2014 [09:17] 14/03/2014 125223174032 125223174032
1 Offside windscreen wiper does not clear the windscreen effectively (8.2.2) Offside windscreen wiper does not clear the windscreen effectively (8.2.2) 14 March 2014 [09:17] 14/03/2014 125223174032 125223174032
1 Nearside front brake pipe inadequately clipped (3.6.b.1) Nearside front brake pipe inadequately clipped (3.6.b.1) 14 March 2014 [09:17] 14/03/2014 125223174032 125223174032
1 Nearside headlamp not working on dipped beam (1.7.5a) Nearside headlamp not working on dipped beam (1.7.5a) 26 March 2012 [08:47] 26/03/2012 688596982085 688596982085
1 Nearside headlamp not working on main beam (1.7.5a) Nearside headlamp not working on main beam (1.7.5a) 26 March 2012 [08:47] 26/03/2012 688596982085 688596982085
1 Nearside front suspension component mounting prescribed area is excessively corroded (2.4.a.3) Nearside front suspension component mounting prescribed area is excessively corroded (2.4.a.3) 26 March 2012 [08:47] 26/03/2012 688596982085 688596982085
1 Offside front suspension component mounting prescribed area is excessively corroded (2.4.a.3) Offside front suspension component mounting prescribed area is excessively corroded (2.4.a.3) 26 March 2012 [08:47] 26/03/2012 688596982085 688596982085
1 Brakes imbalanced across an axle (3.7.b.5b) Brakes imbalanced across an axle (3.7.b.5b) 31 March 2011 [09:31] 31/03/2011 967480491080 967480491080

ALL 634 XUT User Entered Faults [2]

ALL User Entered faults, ORDERED by OCCURRENCE DURING 634 XUT's MOT HISTORY
ALL 634 XUT User Entered Faults [2]
ALL User Entered faults, ORDERED by OCCURRENCE DURING 634 XUT's MOT HISTORY
User Entered Faults | source www.vehiclestats.co.uk
Fault Fault Test Date Test Date/Time Reference MOT Test Reference
2 Nearside rear brake has slightly restricted free movement Nearside rear brake has slightly restricted free movement 31 March 2011 [16:51] 31/03/2011 31 March 2011 [09:31] 31/03/2011 655980891016 655980891016 967480491080 967480491080

ALL 634 XUT Pass With Rectification Faults [2]

ALL Pass With Rectification faults, ORDERED by OCCURRENCE DURING 634 XUT's MOT HISTORY
ALL 634 XUT Pass With Rectification Faults [2]
ALL Pass With Rectification faults, ORDERED by OCCURRENCE DURING 634 XUT's MOT HISTORY
Pass With Rectification Faults | source www.vehiclestats.co.uk
Fault Fault Test Date Test Date/Time Reference MOT Test Reference
1 Registration plate lamp not working (1.1.c.1d) Registration plate lamp not working (1.1.c.1d) 11 March 2015 [11:50] 11/03/2015 815360275029 815360275029
1 Offside front suspension component mounting prescribed area is excessively corroded (2.4.a.3) Offside front suspension component mounting prescribed area is excessively corroded (2.4.a.3) 25 March 2013 [16:30] 25/03/2013 598334083030 598334083030

MOT TEST: 08 May 2019 13:47:46 PASSED
MOT TEST: 08 May 2019 13:47:46 PASSED

This test (128404250844) was completed on the 08 May 2019 13:47:46 and PASSED the requirements for a valid MOT with 0 comments.

This test (128404250844) was completed on the 08 May 2019 13:47:46 and PASSED the requirements for a valid MOT with 0 comments.

Recorded mileage: 7,956

Recorded mileage: 7,956


MOT TEST: 08 May 2019 11:42:31 FAILED
MOT TEST: 08 May 2019 11:42:31 FAILED

This test (970111038116) was completed on the 08 May 2019 11:42:31 and FAILED the requirements for a valid MOT with 3 comments.

This test (970111038116) was completed on the 08 May 2019 11:42:31 and FAILED the requirements for a valid MOT with 3 comments.

Recorded mileage: 7,956

Recorded mileage: 7,956


FAIL


MOT TEST: 25 January 2018 13:03:47 PASSED
MOT TEST: 25 January 2018 13:03:47 PASSED

This test (360378781324) was completed on the 25 January 2018 13:03:47 and PASSED the requirements for a valid MOT with 1 comments.

This test (360378781324) was completed on the 25 January 2018 13:03:47 and PASSED the requirements for a valid MOT with 1 comments.

Recorded mileage: 7,199

Recorded mileage: 7,199


ADVISORY


MOT TEST: 01 February 2017 09:17:16 PASSED
MOT TEST: 01 February 2017 09:17:16 PASSED

This test (674754406689) was completed on the 01 February 2017 09:17:16 and PASSED the requirements for a valid MOT with 0 comments.

This test (674754406689) was completed on the 01 February 2017 09:17:16 and PASSED the requirements for a valid MOT with 0 comments.

Recorded mileage: 7,066

Recorded mileage: 7,066


MOT TEST: 30 January 2017 12:34:03 FAILED
MOT TEST: 30 January 2017 12:34:03 FAILED

This test (554161894182) was completed on the 30 January 2017 12:34:03 and FAILED the requirements for a valid MOT with 1 comments.

This test (554161894182) was completed on the 30 January 2017 12:34:03 and FAILED the requirements for a valid MOT with 1 comments.

Recorded mileage: 7,066

Recorded mileage: 7,066


FAIL


MOT TEST: 15 February 2016 13:09:06 PASSED
MOT TEST: 15 February 2016 13:09:06 PASSED

This test (206226507756) was completed on the 15 February 2016 13:09:06 and PASSED the requirements for a valid MOT with 0 comments.

This test (206226507756) was completed on the 15 February 2016 13:09:06 and PASSED the requirements for a valid MOT with 0 comments.

Recorded mileage: 7,050

Recorded mileage: 7,050


MOT TEST: 11 March 2015 11:50:01 PASSED
MOT TEST: 11 March 2015 11:50:01 PASSED

This test (105330475491) was completed on the 11 March 2015 11:50:01 and PASSED the requirements for a valid MOT with 0 comments.

This test (105330475491) was completed on the 11 March 2015 11:50:01 and PASSED the requirements for a valid MOT with 0 comments.

Recorded mileage: 7,049

Recorded mileage: 7,049


MOT TEST: 11 March 2015 11:50:01 FAILED
MOT TEST: 11 March 2015 11:50:01 FAILED

This test (815360275029) was completed on the 11 March 2015 11:50:01 and FAILED the requirements for a valid MOT with 1 comments.

This test (815360275029) was completed on the 11 March 2015 11:50:01 and FAILED the requirements for a valid MOT with 1 comments.

Recorded mileage: 7,049

Recorded mileage: 7,049


PASS WITH RECTIFICATION


MOT TEST: 17 March 2014 15:52:51 PASSED
MOT TEST: 17 March 2014 15:52:51 PASSED

This test (935766974011) was completed on the 17 March 2014 15:52:51 and PASSED the requirements for a valid MOT with 0 comments.

This test (935766974011) was completed on the 17 March 2014 15:52:51 and PASSED the requirements for a valid MOT with 0 comments.

Recorded mileage: 6,716

Recorded mileage: 6,716


MOT TEST: 14 March 2014 09:17:53 FAILED
MOT TEST: 14 March 2014 09:17:53 FAILED

This test (125223174032) was completed on the 14 March 2014 09:17:53 and FAILED the requirements for a valid MOT with 8 comments.

This test (125223174032) was completed on the 14 March 2014 09:17:53 and FAILED the requirements for a valid MOT with 8 comments.

Recorded mileage: 6,716

Recorded mileage: 6,716


FAIL


MOT TEST: 25 March 2013 16:30:27 PASSED
MOT TEST: 25 March 2013 16:30:27 PASSED

This test (329294483064) was completed on the 25 March 2013 16:30:27 and PASSED the requirements for a valid MOT with 0 comments.

This test (329294483064) was completed on the 25 March 2013 16:30:27 and PASSED the requirements for a valid MOT with 0 comments.

Recorded mileage: 6,517

Recorded mileage: 6,517


MOT TEST: 25 March 2013 16:30:27 FAILED
MOT TEST: 25 March 2013 16:30:27 FAILED

This test (598334083030) was completed on the 25 March 2013 16:30:27 and FAILED the requirements for a valid MOT with 1 comments.

This test (598334083030) was completed on the 25 March 2013 16:30:27 and FAILED the requirements for a valid MOT with 1 comments.

Recorded mileage: 6,517

Recorded mileage: 6,517


PASS WITH RECTIFICATION


MOT TEST: 29 March 2012 08:43:20 PASSED
MOT TEST: 29 March 2012 08:43:20 PASSED

This test (705849682041) was completed on the 29 March 2012 08:43:20 and PASSED the requirements for a valid MOT with 0 comments.

This test (705849682041) was completed on the 29 March 2012 08:43:20 and PASSED the requirements for a valid MOT with 0 comments.

Recorded mileage: 6,278

Recorded mileage: 6,278


MOT TEST: 26 March 2012 08:47:45 FAILED
MOT TEST: 26 March 2012 08:47:45 FAILED

This test (688596982085) was completed on the 26 March 2012 08:47:45 and FAILED the requirements for a valid MOT with 4 comments.

This test (688596982085) was completed on the 26 March 2012 08:47:45 and FAILED the requirements for a valid MOT with 4 comments.

Recorded mileage: 6,278

Recorded mileage: 6,278


FAIL


MOT TEST: 31 March 2011 16:51:15 PASSED
MOT TEST: 31 March 2011 16:51:15 PASSED

This test (655980891016) was completed on the 31 March 2011 16:51:15 and PASSED the requirements for a valid MOT with 1 comments.

This test (655980891016) was completed on the 31 March 2011 16:51:15 and PASSED the requirements for a valid MOT with 1 comments.

Recorded mileage: 5,895

Recorded mileage: 5,895


USER ENTERED


MOT TEST: 31 March 2011 09:31:55 FAILED
MOT TEST: 31 March 2011 09:31:55 FAILED

This test (967480491080) was completed on the 31 March 2011 09:31:55 and FAILED the requirements for a valid MOT with 2 comments.

This test (967480491080) was completed on the 31 March 2011 09:31:55 and FAILED the requirements for a valid MOT with 2 comments.

Recorded mileage: 5,895

Recorded mileage: 5,895


FAIL

USER ENTERED


MOT TEST: 16 July 2008 14:28:37 PASSED
MOT TEST: 16 July 2008 14:28:37 PASSED

This test (200498198449) was completed on the 16 July 2008 14:28:37 and PASSED the requirements for a valid MOT with 0 comments.

This test (200498198449) was completed on the 16 July 2008 14:28:37 and PASSED the requirements for a valid MOT with 0 comments.

Recorded mileage: 5,894

Recorded mileage: 5,894