636 XUN


636XUN is registered to a Cream 1963, Morris Minor 1000 with a Petrol engine. It Passed its most recent MOT Test on the 10 May 2019

19 unique faults (21 Total) reported in its MOT History (19 Tests).

2 common/recurring faults, the most frequent (2 times) is: Parking brake: efficiency below requirements (3.7.B.7).

68% (13) MOT Pass Rate and a 32% (6) MOT Failure Rate.

93,184 recorded miles.

636 XUN


636XUN is registered to a Cream 1963, Morris Minor 1000 with a Petrol engine. It Passed its most recent MOT Test on the 10 May 2019

19 unique faults (21 Total) reported in its MOT History (19 Tests).

2 common/recurring faults, the most frequent (2 times) is: Parking brake: efficiency below requirements (3.7.B.7).

68% (13) MOT Pass Rate and a 32% (6) MOT Failure Rate.

93,184 recorded miles.

MOT PASS/Failure rate for 636 XUN

all MOT test results for 636 XUN represented as a percentage
MOT PASS/Failure rate for 636 XUN
all MOT test results for 636 XUN represented as a percentage

PERCENTAGE OF VEHICLE FAULTS WITH 636 XUN

ALL REPORTED FAULTS, DISPLAYED BY PERCENTAGE OF OCCURRENCE DURING ALL MOT TESTS
PERCENTAGE OF VEHICLE FAULTS WITH 636 XUN
ALL REPORTED FAULTS, DISPLAYED BY PERCENTAGE OF OCCURRENCE DURING ALL MOT TESTS
ADVISORY

FAIL

USER ENTERED

PASS WITH RECTIFICATION

636 XUN annual Faults by type

ALL REPORTED FAULTS, DISPLAYED over time and categorised by type
636 XUN annual Faults by type
ALL REPORTED FAULTS, DISPLAYED over time and categorised by type

RECURRING FAULTS WITH 636 XUN

FAULTS THAT HAVE OCCURED MORE THAN ONCE DURING 636 XUN's MOT HISTORY
RECURRING FAULTS WITH 636 XUN
FAULTS THAT HAVE OCCURED MORE THAN ONCE DURING 636 XUN's MOT HISTORY
Fault Fault Test Date Test Date/Time Reference MOT Test Reference
2 Parking brake: efficiency below requirements (3.7.b.7) Parking brake: efficiency below requirements (3.7.b.7) 19 September 2012 [12:43] 19/09/2012 02 August 2010 [08:23] 02/08/2010 346063662484 346063662484 701204610265 701204610265
2 Offside rear rear brake binding (3.7.b.1) Offside rear rear brake binding (3.7.b.1) 06 August 2010 [08:12] 06/08/2010 02 August 2010 [08:23] 02/08/2010 442758610258 442758610258 701204610265 701204610265

ALL 636 XUN ADVISORIES [2]

ALL ADVISORIES, ORDERED by OCCURRENCE DURING 636 XUN's MOT HISTORY
ALL 636 XUN ADVISORIES [2]
ALL ADVISORIES, ORDERED by OCCURRENCE DURING 636 XUN's MOT HISTORY
Advisory Faults | source www.vehiclestats.co.uk
Fault Fault Test Date Test Date/Time Reference MOT Test Reference
1 Nearside front brake fluctuating, but not excessively (3.7.b.3) Nearside front brake fluctuating, but not excessively (3.7.b.3) 20 September 2013 [09:03] 20/09/2013 739273563263 739273563263
1 Offside front brake fluctuating, but not excessively (3.7.b.3) Offside front brake fluctuating, but not excessively (3.7.b.3) 20 September 2013 [09:03] 20/09/2013 739273563263 739273563263

ALL 636 XUN Failure Faults [16]

ALL Failure faults, ORDERED by OCCURRENCE DURING 636 XUN's MOT HISTORY
ALL 636 XUN Failure Faults [16]
ALL Failure faults, ORDERED by OCCURRENCE DURING 636 XUN's MOT HISTORY
Fail Faults | source www.vehiclestats.co.uk
Fault Fault Test Date Test Date/Time Reference MOT Test Reference
2 Parking brake: efficiency below requirements (3.7.b.7) Parking brake: efficiency below requirements (3.7.b.7) 19 September 2012 [12:43] 19/09/2012 02 August 2010 [08:23] 02/08/2010 346063662484 346063662484 701204610265 701204610265
2 Offside rear rear brake binding (3.7.b.1) Offside rear rear brake binding (3.7.b.1) 06 August 2010 [08:12] 06/08/2010 02 August 2010 [08:23] 02/08/2010 442758610258 442758610258 701204610265 701204610265
1 Nearside rear rear brake binding (3.7.b.1) Nearside rear rear brake binding (3.7.b.1) 06 August 2010 [08:12] 06/08/2010 442758610258 442758610258
1 Fuel cap/sealing device does not fasten securely maintaining the sealing arrangement (7.2.4b) Fuel cap/sealing device does not fasten securely maintaining the sealing arrangement (7.2.4b) 02 August 2010 [08:23] 02/08/2010 701204610265 701204610265
1 Nearside rear rear brake recording little or no effort (3.7.b.5a) Nearside rear rear brake recording little or no effort (3.7.b.5a) 02 August 2010 [08:23] 02/08/2010 701204610265 701204610265
1 Nearside rear brake application uneven (3.7.b.2) Nearside rear brake application uneven (3.7.b.2) 02 August 2010 [08:23] 02/08/2010 701204610265 701204610265
1 Parking brake lever has no reserve travel (3.1.6b) Parking brake lever has no reserve travel (3.1.6b) 02 August 2010 [08:23] 02/08/2010 701204610265 701204610265
1 Windscreen washer provides insufficient washer liquid (8.2.3) Windscreen washer provides insufficient washer liquid (8.2.3) 02 August 2010 [08:23] 02/08/2010 701204610265 701204610265
1 Offside windscreen washer provides insufficient washer liquid (8.2.3) Offside windscreen washer provides insufficient washer liquid (8.2.3) 02 August 2010 [08:23] 02/08/2010 701204610265 701204610265
1 Nearside rear suspension spring mounting prescribed area is excessively corroded (2.4.a.3) Nearside rear suspension spring mounting prescribed area is excessively corroded (2.4.a.3) 30 July 2009 [18:12] 30/07/2009 100571719283 100571719283
1 Offside front headlamp not working on dipped beam (1.7.5a) Offside front headlamp not working on dipped beam (1.7.5a) 25 July 2006 [11:27] 25/07/2006 983736406286 983736406286
1 Offside front headlamp not working on main beam (1.7.5a) Offside front headlamp not working on main beam (1.7.5a) 25 July 2006 [11:27] 25/07/2006 983736406286 983736406286
1 Nearside front windscreen wiper does not clear the windscreen effectively (8.2.2) Nearside front windscreen wiper does not clear the windscreen effectively (8.2.2) 25 July 2006 [11:27] 25/07/2006 983736406286 983736406286
1 Nearside front steering rack gaiter split (2.2.d.2d) Nearside front steering rack gaiter split (2.2.d.2d) 25 July 2006 [11:27] 25/07/2006 983736406286 983736406286

ALL 636 XUN User Entered Faults [2]

ALL User Entered faults, ORDERED by OCCURRENCE DURING 636 XUN's MOT HISTORY
ALL 636 XUN User Entered Faults [2]
ALL User Entered faults, ORDERED by OCCURRENCE DURING 636 XUN's MOT HISTORY
Advisory Faults | source www.vehiclestats.co.uk
Fault Fault Test Date Test Date/Time Reference MOT Test Reference
1 Tyre walls cracking n/s/f n/s/r o/s/f o/s/r Tyre walls cracking n/s/f n/s/r o/s/f o/s/r 20 September 2013 [09:03] 20/09/2013 739273563263 739273563263
1 Oil leak Oil leak 30 July 2009 [18:12] 30/07/2009 100571719283 100571719283

ALL 636 XUN Pass With Rectification Faults [1]

ALL Pass With Rectification faults, ORDERED by OCCURRENCE DURING 636 XUN's MOT HISTORY
ALL 636 XUN Pass With Rectification Faults [1]
ALL Pass With Rectification faults, ORDERED by OCCURRENCE DURING 636 XUN's MOT HISTORY
Pass With Rectification Faults | source www.vehiclestats.co.uk
Fault Fault Test Date Test Date/Time Reference MOT Test Reference
1 Offside front position lamp(s) not working (1.1.a.3b) Offside front position lamp(s) not working (1.1.a.3b) 16 May 2018 [08:19] 16/05/2018 515479036686 515479036686

MOT TEST: 10 May 2019 07:22:54 PASSED
MOT TEST: 10 May 2019 07:22:54 PASSED

This test (372651263849) was completed on the 10 May 2019 07:22:54 and PASSED the requirements for a valid MOT with 0 comments.

This test (372651263849) was completed on the 10 May 2019 07:22:54 and PASSED the requirements for a valid MOT with 0 comments.

Recorded mileage: 93,184

Recorded mileage: 93,184


MOT TEST: 16 May 2018 08:19:04 PASSED
MOT TEST: 16 May 2018 08:19:04 PASSED

This test (105626413871) was completed on the 16 May 2018 08:19:04 and PASSED the requirements for a valid MOT with 0 comments.

This test (105626413871) was completed on the 16 May 2018 08:19:04 and PASSED the requirements for a valid MOT with 0 comments.

Recorded mileage: 92,392

Recorded mileage: 92,392


MOT TEST: 16 May 2018 08:19:03 FAILED
MOT TEST: 16 May 2018 08:19:03 FAILED

This test (515479036686) was completed on the 16 May 2018 08:19:03 and FAILED the requirements for a valid MOT with 1 comments.

This test (515479036686) was completed on the 16 May 2018 08:19:03 and FAILED the requirements for a valid MOT with 1 comments.

Recorded mileage: 92,392

Recorded mileage: 92,392


PASS WITH RECTIFICATION


MOT TEST: 31 May 2017 14:10:25 PASSED
MOT TEST: 31 May 2017 14:10:25 PASSED

This test (489522794697) was completed on the 31 May 2017 14:10:25 and PASSED the requirements for a valid MOT with 0 comments.

This test (489522794697) was completed on the 31 May 2017 14:10:25 and PASSED the requirements for a valid MOT with 0 comments.

Recorded mileage: 90,070

Recorded mileage: 90,070


MOT TEST: 08 June 2016 16:50:05 PASSED
MOT TEST: 08 June 2016 16:50:05 PASSED

This test (222588427538) was completed on the 08 June 2016 16:50:05 and PASSED the requirements for a valid MOT with 0 comments.

This test (222588427538) was completed on the 08 June 2016 16:50:05 and PASSED the requirements for a valid MOT with 0 comments.

Recorded mileage: 89,208

Recorded mileage: 89,208


MOT TEST: 23 September 2014 09:17:14 PASSED
MOT TEST: 23 September 2014 09:17:14 PASSED

This test (406336464217) was completed on the 23 September 2014 09:17:14 and PASSED the requirements for a valid MOT with 0 comments.

This test (406336464217) was completed on the 23 September 2014 09:17:14 and PASSED the requirements for a valid MOT with 0 comments.

Recorded mileage: 87,847

Recorded mileage: 87,847


MOT TEST: 20 September 2013 09:03:12 PASSED
MOT TEST: 20 September 2013 09:03:12 PASSED

This test (739273563263) was completed on the 20 September 2013 09:03:12 and PASSED the requirements for a valid MOT with 3 comments.

This test (739273563263) was completed on the 20 September 2013 09:03:12 and PASSED the requirements for a valid MOT with 3 comments.

Recorded mileage: 87,233

Recorded mileage: 87,233


ADVISORY

USER ENTERED


MOT TEST: 19 September 2012 14:41:54 PASSED
MOT TEST: 19 September 2012 14:41:54 PASSED

This test (395443962274) was completed on the 19 September 2012 14:41:54 and PASSED the requirements for a valid MOT with 0 comments.

This test (395443962274) was completed on the 19 September 2012 14:41:54 and PASSED the requirements for a valid MOT with 0 comments.

Recorded mileage: 86,847

Recorded mileage: 86,847


MOT TEST: 19 September 2012 12:43:59 FAILED
MOT TEST: 19 September 2012 12:43:59 FAILED

This test (346063662484) was completed on the 19 September 2012 12:43:59 and FAILED the requirements for a valid MOT with 1 comments.

This test (346063662484) was completed on the 19 September 2012 12:43:59 and FAILED the requirements for a valid MOT with 1 comments.

Recorded mileage: 86,847

Recorded mileage: 86,847


FAIL


MOT TEST: 28 September 2011 09:41:56 PASSED
MOT TEST: 28 September 2011 09:41:56 PASSED

This test (937611871281) was completed on the 28 September 2011 09:41:56 and PASSED the requirements for a valid MOT with 0 comments.

This test (937611871281) was completed on the 28 September 2011 09:41:56 and PASSED the requirements for a valid MOT with 0 comments.

Recorded mileage: 85,905

Recorded mileage: 85,905


MOT TEST: 13 August 2010 15:29:47 PASSED
MOT TEST: 13 August 2010 15:29:47 PASSED

This test (432845420226) was completed on the 13 August 2010 15:29:47 and PASSED the requirements for a valid MOT with 0 comments.

This test (432845420226) was completed on the 13 August 2010 15:29:47 and PASSED the requirements for a valid MOT with 0 comments.

Recorded mileage: 85,624

Recorded mileage: 85,624


MOT TEST: 06 August 2010 08:12:12 FAILED
MOT TEST: 06 August 2010 08:12:12 FAILED

This test (442758610258) was completed on the 06 August 2010 08:12:12 and FAILED the requirements for a valid MOT with 2 comments.

This test (442758610258) was completed on the 06 August 2010 08:12:12 and FAILED the requirements for a valid MOT with 2 comments.

Recorded mileage: 85,603

Recorded mileage: 85,603


FAIL


MOT TEST: 02 August 2010 08:23:39 FAILED
MOT TEST: 02 August 2010 08:23:39 FAILED

This test (701204610265) was completed on the 02 August 2010 08:23:39 and FAILED the requirements for a valid MOT with 8 comments.

This test (701204610265) was completed on the 02 August 2010 08:23:39 and FAILED the requirements for a valid MOT with 8 comments.

Recorded mileage: 85,590

Recorded mileage: 85,590


FAIL


MOT TEST: 19 August 2009 18:04:28 PASSED
MOT TEST: 19 August 2009 18:04:28 PASSED

This test (631481239298) was completed on the 19 August 2009 18:04:28 and PASSED the requirements for a valid MOT with 0 comments.

This test (631481239298) was completed on the 19 August 2009 18:04:28 and PASSED the requirements for a valid MOT with 0 comments.

Recorded mileage: 84,888

Recorded mileage: 84,888


MOT TEST: 30 July 2009 18:12:30 FAILED
MOT TEST: 30 July 2009 18:12:30 FAILED

This test (100571719283) was completed on the 30 July 2009 18:12:30 and FAILED the requirements for a valid MOT with 2 comments.

This test (100571719283) was completed on the 30 July 2009 18:12:30 and FAILED the requirements for a valid MOT with 2 comments.

Recorded mileage: 84,835

Recorded mileage: 84,835


FAIL

USER ENTERED


MOT TEST: 12 August 2008 09:53:59 PASSED
MOT TEST: 12 August 2008 09:53:59 PASSED

This test (392485328497) was completed on the 12 August 2008 09:53:59 and PASSED the requirements for a valid MOT with 0 comments.

This test (392485328497) was completed on the 12 August 2008 09:53:59 and PASSED the requirements for a valid MOT with 0 comments.

Recorded mileage: 84,075

Recorded mileage: 84,075


MOT TEST: 22 August 2007 17:40:23 PASSED
MOT TEST: 22 August 2007 17:40:23 PASSED

This test (710054437270) was completed on the 22 August 2007 17:40:23 and PASSED the requirements for a valid MOT with 0 comments.

This test (710054437270) was completed on the 22 August 2007 17:40:23 and PASSED the requirements for a valid MOT with 0 comments.

Recorded mileage: 83,988

Recorded mileage: 83,988


MOT TEST: 29 July 2006 13:01:22 PASSED
MOT TEST: 29 July 2006 13:01:22 PASSED

This test (921340616208) was completed on the 29 July 2006 13:01:22 and PASSED the requirements for a valid MOT with 0 comments.

This test (921340616208) was completed on the 29 July 2006 13:01:22 and PASSED the requirements for a valid MOT with 0 comments.

Recorded mileage: 83,684

Recorded mileage: 83,684


MOT TEST: 25 July 2006 11:27:56 FAILED
MOT TEST: 25 July 2006 11:27:56 FAILED

This test (983736406286) was completed on the 25 July 2006 11:27:56 and FAILED the requirements for a valid MOT with 4 comments.

This test (983736406286) was completed on the 25 July 2006 11:27:56 and FAILED the requirements for a valid MOT with 4 comments.

Recorded mileage: 83,680

Recorded mileage: 83,680


FAIL