638 JPX


638JPX is registered to a Green 1963, Morris Minor 1000 with a Petrol engine. It Failed its most recent MOT Test on the 07 March 2012

16 unique faults (17 Total) reported in its MOT History (9 Tests).

1 common/recurring faults.

67% (6) MOT Pass Rate and a 33% (3) MOT Failure Rate.

84,571 recorded miles.

638 JPX


638JPX is registered to a Green 1963, Morris Minor 1000 with a Petrol engine. It Failed its most recent MOT Test on the 07 March 2012

16 unique faults (17 Total) reported in its MOT History (9 Tests).

1 common/recurring faults.

67% (6) MOT Pass Rate and a 33% (3) MOT Failure Rate.

84,571 recorded miles.

MOT PASS/Failure rate for 638 JPX

all MOT test results for 638 JPX represented as a percentage
MOT PASS/Failure rate for 638 JPX
all MOT test results for 638 JPX represented as a percentage

PERCENTAGE OF VEHICLE FAULTS WITH 638 JPX

ALL REPORTED FAULTS, DISPLAYED BY PERCENTAGE OF OCCURRENCE DURING ALL MOT TESTS
PERCENTAGE OF VEHICLE FAULTS WITH 638 JPX
ALL REPORTED FAULTS, DISPLAYED BY PERCENTAGE OF OCCURRENCE DURING ALL MOT TESTS
ADVISORY

FAIL

USER ENTERED

638 JPX annual Faults by type

ALL REPORTED FAULTS, DISPLAYED over time and categorised by type
638 JPX annual Faults by type
ALL REPORTED FAULTS, DISPLAYED over time and categorised by type

ALL 638 JPX ADVISORIES [2]

ALL ADVISORIES, ORDERED by OCCURRENCE DURING 638 JPX's MOT HISTORY
ALL 638 JPX ADVISORIES [2]
ALL ADVISORIES, ORDERED by OCCURRENCE DURING 638 JPX's MOT HISTORY
Fail Faults | source www.vehiclestats.co.uk
Fault Fault Test Date Test Date/Time Reference MOT Test Reference
1 Offside front direction indicator slightly discoloured (1.4.a.2f) Offside front direction indicator slightly discoloured (1.4.a.2f) 01 May 2008 [11:17] 01/05/2008 271172728452 271172728452
1 Nearside front direction indicator slightly discoloured (1.4.a.2f) Nearside front direction indicator slightly discoloured (1.4.a.2f) 01 May 2008 [11:17] 01/05/2008 271172728452 271172728452

ALL 638 JPX Failure Faults [13]

ALL Failure faults, ORDERED by OCCURRENCE DURING 638 JPX's MOT HISTORY
ALL 638 JPX Failure Faults [13]
ALL Failure faults, ORDERED by OCCURRENCE DURING 638 JPX's MOT HISTORY
Fail Faults | source www.vehiclestats.co.uk
Fault Fault Test Date Test Date/Time Reference MOT Test Reference
1 Nearside direction indicators not working (1.4.a.2c) Nearside direction indicators not working (1.4.a.2c) 24 February 2011 [16:44] 24/02/2011 178055451071 178055451071
1 Offside direction indicators not working (1.4.a.2c) Offside direction indicators not working (1.4.a.2c) 24 February 2011 [16:44] 24/02/2011 178055451071 178055451071
1 Registration plate lamp not working (1.1.c.1d) Registration plate lamp not working (1.1.c.1d) 24 February 2011 [16:44] 24/02/2011 178055451071 178055451071
1 Offside front suspension component mounting prescribed area is excessively corroded (2.4.a.3) Offside front suspension component mounting prescribed area is excessively corroded (2.4.a.3) 24 February 2011 [16:44] 24/02/2011 178055451071 178055451071
1 Nearside headlamp aim too high (1.8) Nearside headlamp aim too high (1.8) 22 December 2009 [17:12] 22/12/2009 574206259341 574206259341
1 Offside headlamp aim too high (1.8) Offside headlamp aim too high (1.8) 22 December 2009 [17:12] 22/12/2009 574206259341 574206259341
1 Exhaust has part of the system excessively deteriorated (7.1.1a) Exhaust has part of the system excessively deteriorated (7.1.1a) 22 December 2009 [17:12] 22/12/2009 574206259341 574206259341
1 Nearside rear brake recording little or no effort (3.7.b.5a) Nearside rear brake recording little or no effort (3.7.b.5a) 22 December 2009 [17:12] 22/12/2009 574206259341 574206259341
1 Nearside rear parking brake recording little or no effort (3.7.b.6a) Nearside rear parking brake recording little or no effort (3.7.b.6a) 22 December 2009 [17:12] 22/12/2009 574206259341 574206259341
1 Nearside rear brake binding (3.7.b.1) Nearside rear brake binding (3.7.b.1) 22 December 2009 [17:12] 22/12/2009 574206259341 574206259341
1 Parking brake: efficiency below requirements (3.7.b.7) Parking brake: efficiency below requirements (3.7.b.7) 22 December 2009 [17:12] 22/12/2009 574206259341 574206259341
1 Nearside front shock absorber insecure (2.7.2b) Nearside front shock absorber insecure (2.7.2b) 01 May 2008 [11:17] 01/05/2008 271172728452 271172728452
1 Nearside registration plate lamp not working (1.1.c.1d) Nearside registration plate lamp not working (1.1.c.1d) 01 May 2008 [11:17] 01/05/2008 271172728452 271172728452

ALL 638 JPX User Entered Faults [2]

ALL User Entered faults, ORDERED by OCCURRENCE DURING 638 JPX's MOT HISTORY
ALL 638 JPX User Entered Faults [2]
ALL User Entered faults, ORDERED by OCCURRENCE DURING 638 JPX's MOT HISTORY
User Entered Faults | source www.vehiclestats.co.uk
Fault Fault Test Date Test Date/Time Reference MOT Test Reference
2 Corrosion at rear of cab on both sides. Corrosion at rear of cab on both sides. 28 February 2011 [16:38] 28/02/2011 24 February 2011 [16:44] 24/02/2011 176659551470 176659551470 178055451071 178055451071

MOT TEST: 07 March 2012 16:55:56 PASSED
MOT TEST: 07 March 2012 16:55:56 PASSED

This test (836807662093) was completed on the 07 March 2012 16:55:56 and PASSED the requirements for a valid MOT with 0 comments.

This test (836807662093) was completed on the 07 March 2012 16:55:56 and PASSED the requirements for a valid MOT with 0 comments.

Recorded mileage: 56,608

Recorded mileage: 56,608


MOT TEST: 28 February 2011 16:38:20 PASSED
MOT TEST: 28 February 2011 16:38:20 PASSED

This test (176659551470) was completed on the 28 February 2011 16:38:20 and PASSED the requirements for a valid MOT with 1 comments.

This test (176659551470) was completed on the 28 February 2011 16:38:20 and PASSED the requirements for a valid MOT with 1 comments.

Recorded mileage: 30,372

Recorded mileage: 30,372


USER ENTERED


MOT TEST: 24 February 2011 16:44:08 FAILED
MOT TEST: 24 February 2011 16:44:08 FAILED

This test (178055451071) was completed on the 24 February 2011 16:44:08 and FAILED the requirements for a valid MOT with 5 comments.

This test (178055451071) was completed on the 24 February 2011 16:44:08 and FAILED the requirements for a valid MOT with 5 comments.

Recorded mileage: 30,372

Recorded mileage: 30,372


FAIL

USER ENTERED


MOT TEST: 31 December 2009 12:16:52 PASSED
MOT TEST: 31 December 2009 12:16:52 PASSED

This test (323825769359) was completed on the 31 December 2009 12:16:52 and PASSED the requirements for a valid MOT with 0 comments.

This test (323825769359) was completed on the 31 December 2009 12:16:52 and PASSED the requirements for a valid MOT with 0 comments.

Recorded mileage: 84,571

Recorded mileage: 84,571


MOT TEST: 22 December 2009 17:12:27 FAILED
MOT TEST: 22 December 2009 17:12:27 FAILED

This test (574206259341) was completed on the 22 December 2009 17:12:27 and FAILED the requirements for a valid MOT with 7 comments.

This test (574206259341) was completed on the 22 December 2009 17:12:27 and FAILED the requirements for a valid MOT with 7 comments.

Recorded mileage: 84,571

Recorded mileage: 84,571


FAIL


MOT TEST: 01 May 2008 16:40:00 PASSED
MOT TEST: 01 May 2008 16:40:00 PASSED

This test (980882928158) was completed on the 01 May 2008 16:40:00 and PASSED the requirements for a valid MOT with 0 comments.

This test (980882928158) was completed on the 01 May 2008 16:40:00 and PASSED the requirements for a valid MOT with 0 comments.

Recorded mileage: 84,571

Recorded mileage: 84,571


MOT TEST: 01 May 2008 11:17:39 FAILED
MOT TEST: 01 May 2008 11:17:39 FAILED

This test (271172728452) was completed on the 01 May 2008 11:17:39 and FAILED the requirements for a valid MOT with 4 comments.

This test (271172728452) was completed on the 01 May 2008 11:17:39 and FAILED the requirements for a valid MOT with 4 comments.

Recorded mileage: 84,571

Recorded mileage: 84,571


ADVISORY

FAIL


MOT TEST: 21 April 2007 11:49:37 PASSED
MOT TEST: 21 April 2007 11:49:37 PASSED

This test (590351917109) was completed on the 21 April 2007 11:49:37 and PASSED the requirements for a valid MOT with 0 comments.

This test (590351917109) was completed on the 21 April 2007 11:49:37 and PASSED the requirements for a valid MOT with 0 comments.

Recorded mileage: 80,477

Recorded mileage: 80,477


MOT TEST: 01 April 2006 11:22:32 PASSED
MOT TEST: 01 April 2006 11:22:32 PASSED

This test (154021996025) was completed on the 01 April 2006 11:22:32 and PASSED the requirements for a valid MOT with 0 comments.

This test (154021996025) was completed on the 01 April 2006 11:22:32 and PASSED the requirements for a valid MOT with 0 comments.

Recorded mileage: 75,650

Recorded mileage: 75,650