642 UXS


642UXS is registered to a Grey 1962, Morris Minor 1000 with a Petrol engine. It Failed its most recent MOT Test on the 15 September 2017

23 unique faults (27 Total) reported in its MOT History (6 Tests).

2 common/recurring faults, the most frequent (2 times) is: Steering column top bearing slightly worn (2.1.2c).

50% (3) MOT Pass Rate and a 50% (3) MOT Failure Rate.

47,482 recorded miles.

642 UXS


642UXS is registered to a Grey 1962, Morris Minor 1000 with a Petrol engine. It Failed its most recent MOT Test on the 15 September 2017

23 unique faults (27 Total) reported in its MOT History (6 Tests).

2 common/recurring faults, the most frequent (2 times) is: Steering column top bearing slightly worn (2.1.2c).

50% (3) MOT Pass Rate and a 50% (3) MOT Failure Rate.

47,482 recorded miles.

MOT PASS/Failure rate for 642 UXS

all MOT test results for 642 UXS represented as a percentage
MOT PASS/Failure rate for 642 UXS
all MOT test results for 642 UXS represented as a percentage

PERCENTAGE OF VEHICLE FAULTS WITH 642 UXS

ALL REPORTED FAULTS, DISPLAYED BY PERCENTAGE OF OCCURRENCE DURING ALL MOT TESTS
PERCENTAGE OF VEHICLE FAULTS WITH 642 UXS
ALL REPORTED FAULTS, DISPLAYED BY PERCENTAGE OF OCCURRENCE DURING ALL MOT TESTS
ADVISORY

FAIL

642 UXS annual Faults by type

ALL REPORTED FAULTS, DISPLAYED over time and categorised by type
642 UXS annual Faults by type
ALL REPORTED FAULTS, DISPLAYED over time and categorised by type

RECURRING FAULTS WITH 642 UXS

FAULTS THAT HAVE OCCURED MORE THAN ONCE DURING 642 UXS's MOT HISTORY
RECURRING FAULTS WITH 642 UXS
FAULTS THAT HAVE OCCURED MORE THAN ONCE DURING 642 UXS's MOT HISTORY
Fault Fault Test Date Test Date/Time Reference MOT Test Reference
2 Steering column top bearing slightly worn (2.1.2c) Steering column top bearing slightly worn (2.1.2c) 15 September 2017 [15:19] 15/09/2017 12 September 2017 [16:05] 12/09/2017 491644541501 491644541501 947224883391 947224883391
2 Parking brake: efficiency below requirements (3.7.b.7) Parking brake: efficiency below requirements (3.7.b.7) 12 September 2017 [16:05] 12/09/2017 26 May 2016 [08:59] 26/05/2016 947224883391 947224883391 928979593805 928979593805

ALL 642 UXS ADVISORIES [3]

ALL ADVISORIES, ORDERED by OCCURRENCE DURING 642 UXS's MOT HISTORY
ALL 642 UXS ADVISORIES [3]
ALL ADVISORIES, ORDERED by OCCURRENCE DURING 642 UXS's MOT HISTORY
Advisory Faults | source www.vehiclestats.co.uk
Fault Fault Test Date Test Date/Time Reference MOT Test Reference
2 Steering column top bearing slightly worn (2.1.2c) Steering column top bearing slightly worn (2.1.2c) 15 September 2017 [15:19] 15/09/2017 12 September 2017 [16:05] 12/09/2017 491644541501 491644541501 947224883391 947224883391
1 Front tie bar/rod rubber bush deteriorated but not resulting in excessive movement both sides (2.4.g.2) Front tie bar/rod rubber bush deteriorated but not resulting in excessive movement both sides (2.4.g.2) 12 September 2017 [16:05] 12/09/2017 947224883391 947224883391

ALL 642 UXS Failure Faults [24]

ALL Failure faults, ORDERED by OCCURRENCE DURING 642 UXS's MOT HISTORY
ALL 642 UXS Failure Faults [24]
ALL Failure faults, ORDERED by OCCURRENCE DURING 642 UXS's MOT HISTORY
Advisory Faults | source www.vehiclestats.co.uk
Fault Fault Test Date Test Date/Time Reference MOT Test Reference
2 Parking brake: efficiency below requirements (3.7.b.7) Parking brake: efficiency below requirements (3.7.b.7) 12 September 2017 [16:05] 12/09/2017 26 May 2016 [08:59] 26/05/2016 947224883391 947224883391 928979593805 928979593805
1 Steering system excessively tight (2.2.d.1) Steering system excessively tight (2.2.d.1) 12 September 2017 [16:05] 12/09/2017 947224883391 947224883391
1 Front headlamp insecure both (1.7.3) Front headlamp insecure both (1.7.3) 12 September 2017 [16:05] 12/09/2017 947224883391 947224883391
1 Rear brake recording little or no effort both sides (3.7.b.5a) Rear brake recording little or no effort both sides (3.7.b.5a) 12 September 2017 [16:05] 12/09/2017 947224883391 947224883391
1 Rear parking brake recording little or no effort (3.7.b.6a) Rear parking brake recording little or no effort (3.7.b.6a) 12 September 2017 [16:05] 12/09/2017 947224883391 947224883391
1 Nearside rear braking system leaking (3.6.a.1) Nearside rear braking system leaking (3.6.a.1) 12 September 2017 [16:05] 12/09/2017 947224883391 947224883391
1 Nearside front direction indicator not working (1.4.a.2c) Nearside front direction indicator not working (1.4.a.2c) 01 July 2016 [12:00] 01/07/2016 549170657905 549170657905
1 Nearside rear direction indicator not working (1.4.a.2c) Nearside rear direction indicator not working (1.4.a.2c) 01 July 2016 [12:00] 01/07/2016 549170657905 549170657905
1 Battery insecure (1.9.1) Battery insecure (1.9.1) 01 July 2016 [12:00] 01/07/2016 549170657905 549170657905
1 Offside front tie bar/rod insecure nut loose (2.4.g.1) Offside front tie bar/rod insecure nut loose (2.4.g.1) 01 July 2016 [12:00] 01/07/2016 549170657905 549170657905
1 Rear mechanical brake component has restricted free movement both sides (3.5.1k) Rear mechanical brake component has restricted free movement both sides (3.5.1k) 01 July 2016 [12:00] 01/07/2016 549170657905 549170657905
1 Service brake: efficiency below requirements (3.7.b.7) Service brake: efficiency below requirements (3.7.b.7) 26 May 2016 [08:59] 26/05/2016 928979593805 928979593805
1 Indicator tell tale inoperative (1.4.a.2a) Indicator tell tale inoperative (1.4.a.2a) 26 May 2016 [08:59] 26/05/2016 928979593805 928979593805
1 Brake pedal creeps down when held under pressure (3.3.b.1a) Brake pedal creeps down when held under pressure (3.3.b.1a) 26 May 2016 [08:59] 26/05/2016 928979593805 928979593805
1 Nearside front inner suspension arm attachment bracket/mounting nut missing (2.4.g.1) Nearside front inner suspension arm attachment bracket/mounting nut missing (2.4.g.1) 26 May 2016 [08:59] 26/05/2016 928979593805 928979593805
1 Nearside front outer suspension arm attachment bracket/mounting nut missing (2.4.g.1) Nearside front outer suspension arm attachment bracket/mounting nut missing (2.4.g.1) 26 May 2016 [08:59] 26/05/2016 928979593805 928979593805
1 Offside front outer suspension arm attachment bracket/mounting nut missing (2.4.g.1) Offside front outer suspension arm attachment bracket/mounting nut missing (2.4.g.1) 26 May 2016 [08:59] 26/05/2016 928979593805 928979593805
1 Nearside front upper suspension arm has excessive play in a pin/bush (2.4.g.2) Nearside front upper suspension arm has excessive play in a pin/bush (2.4.g.2) 26 May 2016 [08:59] 26/05/2016 928979593805 928979593805
1 Nearside front upper suspension arm locating pin locking device missing (2.4.g.3b) Nearside front upper suspension arm locating pin locking device missing (2.4.g.3b) 26 May 2016 [08:59] 26/05/2016 928979593805 928979593805
1 Nearside windscreen wiper does not clear the windscreen effectively (8.2.2) Nearside windscreen wiper does not clear the windscreen effectively (8.2.2) 26 May 2016 [08:59] 26/05/2016 928979593805 928979593805
1 Offside windscreen wiper does not clear the windscreen effectively (8.2.2) Offside windscreen wiper does not clear the windscreen effectively (8.2.2) 26 May 2016 [08:59] 26/05/2016 928979593805 928979593805

MOT TEST: 15 September 2017 15:19:34 PASSED
MOT TEST: 15 September 2017 15:19:34 PASSED

This test (491644541501) was completed on the 15 September 2017 15:19:34 and PASSED the requirements for a valid MOT with 1 comments.

This test (491644541501) was completed on the 15 September 2017 15:19:34 and PASSED the requirements for a valid MOT with 1 comments.

Recorded mileage: 9,770

Recorded mileage: 9,770


ADVISORY


MOT TEST: 12 September 2017 16:05:22 FAILED
MOT TEST: 12 September 2017 16:05:22 FAILED

This test (947224883391) was completed on the 12 September 2017 16:05:22 and FAILED the requirements for a valid MOT with 8 comments.

This test (947224883391) was completed on the 12 September 2017 16:05:22 and FAILED the requirements for a valid MOT with 8 comments.

Recorded mileage: 9,769

Recorded mileage: 9,769


ADVISORY

FAIL


MOT TEST: 01 July 2016 14:57:08 PASSED
MOT TEST: 01 July 2016 14:57:08 PASSED

This test (118242500694) was completed on the 01 July 2016 14:57:08 and PASSED the requirements for a valid MOT with 0 comments.

This test (118242500694) was completed on the 01 July 2016 14:57:08 and PASSED the requirements for a valid MOT with 0 comments.

Recorded mileage: 8,902

Recorded mileage: 8,902


MOT TEST: 01 July 2016 12:00:55 FAILED
MOT TEST: 01 July 2016 12:00:55 FAILED

This test (549170657905) was completed on the 01 July 2016 12:00:55 and FAILED the requirements for a valid MOT with 5 comments.

This test (549170657905) was completed on the 01 July 2016 12:00:55 and FAILED the requirements for a valid MOT with 5 comments.

Recorded mileage: 8,902

Recorded mileage: 8,902


FAIL


MOT TEST: 26 May 2016 08:59:07 FAILED
MOT TEST: 26 May 2016 08:59:07 FAILED

This test (928979593805) was completed on the 26 May 2016 08:59:07 and FAILED the requirements for a valid MOT with 13 comments.

This test (928979593805) was completed on the 26 May 2016 08:59:07 and FAILED the requirements for a valid MOT with 13 comments.

Recorded mileage: 8,720

Recorded mileage: 8,720


FAIL


MOT TEST: 15 November 2005 17:22:35 PASSED
MOT TEST: 15 November 2005 17:22:35 PASSED

This test (483049815440) was completed on the 15 November 2005 17:22:35 and PASSED the requirements for a valid MOT with 0 comments.

This test (483049815440) was completed on the 15 November 2005 17:22:35 and PASSED the requirements for a valid MOT with 0 comments.

Recorded mileage: 47,482

Recorded mileage: 47,482