644 YUS


644YUS is registered to a Green 1962, Morris Minor 1000 with a Petrol engine. It Failed its most recent MOT Test on the 18 March 2016

15 unique faults (17 Total) reported in its MOT History (10 Tests).

1 common/recurring faults.

70% (7) MOT Pass Rate and a 30% (3) MOT Failure Rate.

91,956 recorded miles.

644 YUS


644YUS is registered to a Green 1962, Morris Minor 1000 with a Petrol engine. It Failed its most recent MOT Test on the 18 March 2016

15 unique faults (17 Total) reported in its MOT History (10 Tests).

1 common/recurring faults.

70% (7) MOT Pass Rate and a 30% (3) MOT Failure Rate.

91,956 recorded miles.

MOT PASS/Failure rate for 644 YUS

all MOT test results for 644 YUS represented as a percentage
MOT PASS/Failure rate for 644 YUS
all MOT test results for 644 YUS represented as a percentage

PERCENTAGE OF VEHICLE FAULTS WITH 644 YUS

ALL REPORTED FAULTS, DISPLAYED BY PERCENTAGE OF OCCURRENCE DURING ALL MOT TESTS
PERCENTAGE OF VEHICLE FAULTS WITH 644 YUS
ALL REPORTED FAULTS, DISPLAYED BY PERCENTAGE OF OCCURRENCE DURING ALL MOT TESTS
ADVISORY

FAIL

USER ENTERED

PASS WITH RECTIFICATION

644 YUS annual Faults by type

ALL REPORTED FAULTS, DISPLAYED over time and categorised by type
644 YUS annual Faults by type
ALL REPORTED FAULTS, DISPLAYED over time and categorised by type

ALL 644 YUS ADVISORIES [5]

ALL ADVISORIES, ORDERED by OCCURRENCE DURING 644 YUS's MOT HISTORY
ALL 644 YUS ADVISORIES [5]
ALL ADVISORIES, ORDERED by OCCURRENCE DURING 644 YUS's MOT HISTORY
Advisory Faults | source www.vehiclestats.co.uk
Fault Fault Test Date Test Date/Time Reference MOT Test Reference
1 Nearside steering rack gaiter deteriorated (2.2.d.2d) Nearside steering rack gaiter deteriorated (2.2.d.2d) 18 March 2016 [14:32] 18/03/2016 892493861633 892493861633
1 Rear leaf spring deteriorated but not seriously weakened (2.4.b.1a) Rear leaf spring deteriorated but not seriously weakened (2.4.b.1a) 16 November 2006 [14:39] 16/11/2006 962490626316 962490626316
1 Body has slight corrosion (6.1.b.2) Body has slight corrosion (6.1.b.2) 16 November 2006 [14:39] 16/11/2006 962490626316 962490626316
1 Nearside axle king pin has slight play in pin and/or bush (2.5.a.3a) Nearside axle king pin has slight play in pin and/or bush (2.5.a.3a) 16 November 2006 [14:39] 16/11/2006 962490626316 962490626316
1 Offside axle king pin has slight play in pin and/or bush (2.5.a.3a) Offside axle king pin has slight play in pin and/or bush (2.5.a.3a) 16 November 2006 [14:39] 16/11/2006 962490626316 962490626316

ALL 644 YUS Failure Faults [7]

ALL Failure faults, ORDERED by OCCURRENCE DURING 644 YUS's MOT HISTORY
ALL 644 YUS Failure Faults [7]
ALL Failure faults, ORDERED by OCCURRENCE DURING 644 YUS's MOT HISTORY
Fail Faults | source www.vehiclestats.co.uk
Fault Fault Test Date Test Date/Time Reference MOT Test Reference
1 Headlamp aim too low (1.8) Headlamp aim too low (1.8) 26 July 2011 [09:33] 26/07/2011 615637601234 615637601234
1 Front passenger door cannot be opened from outside the vehicle (6.2.b.1b) Front passenger door cannot be opened from outside the vehicle (6.2.b.1b) 26 July 2011 [09:33] 26/07/2011 615637601234 615637601234
1 Nearside front brake binding (3.7.b.1) Nearside front brake binding (3.7.b.1) 30 July 2010 [12:39] 30/07/2010 430781910256 430781910256
1 Nearside steering rack gaiter split (2.2.d.2d) Nearside steering rack gaiter split (2.2.d.2d) 30 July 2010 [12:39] 30/07/2010 430781910256 430781910256
1 Offside front suspension component mounting prescribed area is excessively corroded (2.4.a.3) Offside front suspension component mounting prescribed area is excessively corroded (2.4.a.3) 30 July 2010 [12:39] 30/07/2010 430781910256 430781910256
1 Nearside rear suspension component mounting prescribed area is excessively corroded (2.4.a.3) Nearside rear suspension component mounting prescribed area is excessively corroded (2.4.a.3) 30 July 2010 [12:39] 30/07/2010 430781910256 430781910256
1 Offside rear suspension component mounting prescribed area is excessively corroded (2.4.a.3) Offside rear suspension component mounting prescribed area is excessively corroded (2.4.a.3) 30 July 2010 [12:39] 30/07/2010 430781910256 430781910256

ALL 644 YUS User Entered Faults [4]

ALL User Entered faults, ORDERED by OCCURRENCE DURING 644 YUS's MOT HISTORY
ALL 644 YUS User Entered Faults [4]
ALL User Entered faults, ORDERED by OCCURRENCE DURING 644 YUS's MOT HISTORY
User Entered Faults | source www.vehiclestats.co.uk
Fault Fault Test Date Test Date/Time Reference MOT Test Reference
3 Oil leak Oil leak 27 July 2011 [11:23] 27/07/2011 26 July 2011 [09:33] 26/07/2011 30 July 2010 [12:39] 30/07/2010 699588001239 699588001239 615637601234 615637601234 430781910256 430781910256
1 Various areas of corrosion under vehicle Various areas of corrosion under vehicle 30 July 2010 [12:39] 30/07/2010 430781910256 430781910256

ALL 644 YUS Pass With Rectification Faults [1]

ALL Pass With Rectification faults, ORDERED by OCCURRENCE DURING 644 YUS's MOT HISTORY
ALL 644 YUS Pass With Rectification Faults [1]
ALL Pass With Rectification faults, ORDERED by OCCURRENCE DURING 644 YUS's MOT HISTORY
Pass With Rectification Faults | source www.vehiclestats.co.uk
Fault Fault Test Date Test Date/Time Reference MOT Test Reference
1 Nearside steering rack gaiter insecure (2.2.d.2d) Nearside steering rack gaiter insecure (2.2.d.2d) 05 September 2013 [10:28] 05/09/2013 465008243228 465008243228

MOT TEST: 18 March 2016 14:32:17 PASSED
MOT TEST: 18 March 2016 14:32:17 PASSED

This test (892493861633) was completed on the 18 March 2016 14:32:17 and PASSED the requirements for a valid MOT with 1 comments.

This test (892493861633) was completed on the 18 March 2016 14:32:17 and PASSED the requirements for a valid MOT with 1 comments.

Recorded mileage: 91,956

Recorded mileage: 91,956


ADVISORY


MOT TEST: 09 September 2014 16:50:41 PASSED
MOT TEST: 09 September 2014 16:50:41 PASSED

This test (825312654211) was completed on the 09 September 2014 16:50:41 and PASSED the requirements for a valid MOT with 0 comments.

This test (825312654211) was completed on the 09 September 2014 16:50:41 and PASSED the requirements for a valid MOT with 0 comments.

Recorded mileage: 91,811

Recorded mileage: 91,811


MOT TEST: 05 September 2013 10:28:40 PASSED
MOT TEST: 05 September 2013 10:28:40 PASSED

This test (318128343245) was completed on the 05 September 2013 10:28:40 and PASSED the requirements for a valid MOT with 0 comments.

This test (318128343245) was completed on the 05 September 2013 10:28:40 and PASSED the requirements for a valid MOT with 0 comments.

Recorded mileage: 91,562

Recorded mileage: 91,562


MOT TEST: 05 September 2013 10:28:40 FAILED
MOT TEST: 05 September 2013 10:28:40 FAILED

This test (465008243228) was completed on the 05 September 2013 10:28:40 and FAILED the requirements for a valid MOT with 1 comments.

This test (465008243228) was completed on the 05 September 2013 10:28:40 and FAILED the requirements for a valid MOT with 1 comments.

Recorded mileage: 91,562

Recorded mileage: 91,562


PASS WITH RECTIFICATION


MOT TEST: 26 July 2012 09:03:58 PASSED
MOT TEST: 26 July 2012 09:03:58 PASSED

This test (179618902241) was completed on the 26 July 2012 09:03:58 and PASSED the requirements for a valid MOT with 0 comments.

This test (179618902241) was completed on the 26 July 2012 09:03:58 and PASSED the requirements for a valid MOT with 0 comments.

Recorded mileage: 90,895

Recorded mileage: 90,895


MOT TEST: 27 July 2011 11:23:09 PASSED
MOT TEST: 27 July 2011 11:23:09 PASSED

This test (699588001239) was completed on the 27 July 2011 11:23:09 and PASSED the requirements for a valid MOT with 1 comments.

This test (699588001239) was completed on the 27 July 2011 11:23:09 and PASSED the requirements for a valid MOT with 1 comments.

Recorded mileage: 90,266

Recorded mileage: 90,266


USER ENTERED


MOT TEST: 26 July 2011 09:33:15 FAILED
MOT TEST: 26 July 2011 09:33:15 FAILED

This test (615637601234) was completed on the 26 July 2011 09:33:15 and FAILED the requirements for a valid MOT with 3 comments.

This test (615637601234) was completed on the 26 July 2011 09:33:15 and FAILED the requirements for a valid MOT with 3 comments.

Recorded mileage: 90,263

Recorded mileage: 90,263


FAIL

USER ENTERED


MOT TEST: 02 August 2010 16:01:28 PASSED
MOT TEST: 02 August 2010 16:01:28 PASSED

This test (504014310220) was completed on the 02 August 2010 16:01:28 and PASSED the requirements for a valid MOT with 0 comments.

This test (504014310220) was completed on the 02 August 2010 16:01:28 and PASSED the requirements for a valid MOT with 0 comments.

Recorded mileage: 89,756

Recorded mileage: 89,756


MOT TEST: 30 July 2010 12:39:58 FAILED
MOT TEST: 30 July 2010 12:39:58 FAILED

This test (430781910256) was completed on the 30 July 2010 12:39:58 and FAILED the requirements for a valid MOT with 7 comments.

This test (430781910256) was completed on the 30 July 2010 12:39:58 and FAILED the requirements for a valid MOT with 7 comments.

Recorded mileage: 89,754

Recorded mileage: 89,754


FAIL

USER ENTERED


MOT TEST: 16 November 2006 14:39:52 PASSED
MOT TEST: 16 November 2006 14:39:52 PASSED

This test (962490626316) was completed on the 16 November 2006 14:39:52 and PASSED the requirements for a valid MOT with 4 comments.

This test (962490626316) was completed on the 16 November 2006 14:39:52 and PASSED the requirements for a valid MOT with 4 comments.

Recorded mileage: 89,172

Recorded mileage: 89,172


ADVISORY