645 UXC


645UXC is registered to a Black 1958, Morris Minor 1000 with a Petrol engine. It Failed its most recent MOT Test on the 03 June 2008

5 unique faults (5 Total) reported in its MOT History (6 Tests).

0 common/recurring faults.

50% (3) MOT Pass Rate and a 50% (3) MOT Failure Rate.

49,995 recorded miles.

645 UXC


645UXC is registered to a Black 1958, Morris Minor 1000 with a Petrol engine. It Failed its most recent MOT Test on the 03 June 2008

5 unique faults (5 Total) reported in its MOT History (6 Tests).

0 common/recurring faults.

50% (3) MOT Pass Rate and a 50% (3) MOT Failure Rate.

49,995 recorded miles.

MOT PASS/Failure rate for 645 UXC

all MOT test results for 645 UXC represented as a percentage
MOT PASS/Failure rate for 645 UXC
all MOT test results for 645 UXC represented as a percentage

PERCENTAGE OF VEHICLE FAULTS WITH 645 UXC

ALL REPORTED FAULTS, DISPLAYED BY PERCENTAGE OF OCCURRENCE DURING ALL MOT TESTS
PERCENTAGE OF VEHICLE FAULTS WITH 645 UXC
ALL REPORTED FAULTS, DISPLAYED BY PERCENTAGE OF OCCURRENCE DURING ALL MOT TESTS
ADVISORY

FAIL

645 UXC annual Faults by type

ALL REPORTED FAULTS, DISPLAYED over time and categorised by type
645 UXC annual Faults by type
ALL REPORTED FAULTS, DISPLAYED over time and categorised by type

ALL 645 UXC ADVISORIES [2]

ALL ADVISORIES, ORDERED by OCCURRENCE DURING 645 UXC's MOT HISTORY
ALL 645 UXC ADVISORIES [2]
ALL ADVISORIES, ORDERED by OCCURRENCE DURING 645 UXC's MOT HISTORY
Fail Faults | source www.vehiclestats.co.uk
Fault Fault Test Date Test Date/Time Reference MOT Test Reference
1 Offside front brake pipe slightly corroded (3.6.b.2c) Offside front brake pipe slightly corroded (3.6.b.2c) 25 May 2007 [15:19] 25/05/2007 284655647102 284655647102
1 Offside rear position lamp(s) slightly discoloured (1.1.a.3e) Offside rear position lamp(s) slightly discoloured (1.1.a.3e) 25 May 2007 [15:19] 25/05/2007 284655647102 284655647102

ALL 645 UXC Failure Faults [3]

ALL Failure faults, ORDERED by OCCURRENCE DURING 645 UXC's MOT HISTORY
ALL 645 UXC Failure Faults [3]
ALL Failure faults, ORDERED by OCCURRENCE DURING 645 UXC's MOT HISTORY
Fail Faults | source www.vehiclestats.co.uk
Fault Fault Test Date Test Date/Time Reference MOT Test Reference
1 Windscreen washer provides insufficient washer liquid (8.2.3) Windscreen washer provides insufficient washer liquid (8.2.3) 03 June 2008 [14:27] 03/06/2008 780625558172 780625558172
1 Nearside front vehicle structure has an unsatisfactory modification, seriously affecting its strength within 30cm of the body mountings (6.1.b.2) Nearside front vehicle structure has an unsatisfactory modification, seriously affecting its strength within 30cm of the body mountings (6.1.b.2) 25 May 2007 [15:19] 25/05/2007 284655647102 284655647102
1 Registration plate lamp not working (1.1.5c) Registration plate lamp not working (1.1.5c) 25 May 2006 [13:20] 25/05/2006 370195946112 370195946112

MOT TEST: 03 June 2008 15:07:09 PASSED
MOT TEST: 03 June 2008 15:07:09 PASSED

This test (754185758190) was completed on the 03 June 2008 15:07:09 and PASSED the requirements for a valid MOT with 0 comments.

This test (754185758190) was completed on the 03 June 2008 15:07:09 and PASSED the requirements for a valid MOT with 0 comments.

Recorded mileage: 49,995

Recorded mileage: 49,995


MOT TEST: 03 June 2008 14:27:02 FAILED
MOT TEST: 03 June 2008 14:27:02 FAILED

This test (780625558172) was completed on the 03 June 2008 14:27:02 and FAILED the requirements for a valid MOT with 1 comments.

This test (780625558172) was completed on the 03 June 2008 14:27:02 and FAILED the requirements for a valid MOT with 1 comments.

Recorded mileage: 49,993

Recorded mileage: 49,993


FAIL


MOT TEST: 29 May 2007 09:42:25 PASSED
MOT TEST: 29 May 2007 09:42:25 PASSED

This test (342929347171) was completed on the 29 May 2007 09:42:25 and PASSED the requirements for a valid MOT with 0 comments.

This test (342929347171) was completed on the 29 May 2007 09:42:25 and PASSED the requirements for a valid MOT with 0 comments.

Recorded mileage: 49,815

Recorded mileage: 49,815


MOT TEST: 25 May 2007 15:19:22 FAILED
MOT TEST: 25 May 2007 15:19:22 FAILED

This test (284655647102) was completed on the 25 May 2007 15:19:22 and FAILED the requirements for a valid MOT with 3 comments.

This test (284655647102) was completed on the 25 May 2007 15:19:22 and FAILED the requirements for a valid MOT with 3 comments.

Recorded mileage: 49,814

Recorded mileage: 49,814


ADVISORY

FAIL


MOT TEST: 25 May 2006 13:57:23 PASSED
MOT TEST: 25 May 2006 13:57:23 PASSED

This test (102915046192) was completed on the 25 May 2006 13:57:23 and PASSED the requirements for a valid MOT with 0 comments.

This test (102915046192) was completed on the 25 May 2006 13:57:23 and PASSED the requirements for a valid MOT with 0 comments.

Recorded mileage: 49,597

Recorded mileage: 49,597


MOT TEST: 25 May 2006 13:20:34 FAILED
MOT TEST: 25 May 2006 13:20:34 FAILED

This test (370195946112) was completed on the 25 May 2006 13:20:34 and FAILED the requirements for a valid MOT with 1 comments.

This test (370195946112) was completed on the 25 May 2006 13:20:34 and FAILED the requirements for a valid MOT with 1 comments.

Recorded mileage: 49,596

Recorded mileage: 49,596


FAIL