646 FKA


646FKA is registered to a Grey 1960, Morris Minor with a Petrol engine. It Failed its most recent MOT Test on the 14 October 2017

12 unique faults (14 Total) reported in its MOT History (15 Tests).

2 common/recurring faults, the most frequent (2 times) is: Nearside Rear Suspension spring mounting prescribed area is corroded but not considered excessive (2.4.A.3).

80% (12) MOT Pass Rate and a 20% (3) MOT Failure Rate.

21,811 recorded miles.

646 FKA


646FKA is registered to a Grey 1960, Morris Minor with a Petrol engine. It Failed its most recent MOT Test on the 14 October 2017

12 unique faults (14 Total) reported in its MOT History (15 Tests).

2 common/recurring faults, the most frequent (2 times) is: Nearside Rear Suspension spring mounting prescribed area is corroded but not considered excessive (2.4.A.3).

80% (12) MOT Pass Rate and a 20% (3) MOT Failure Rate.

21,811 recorded miles.

MOT PASS/Failure rate for 646 FKA

all MOT test results for 646 FKA represented as a percentage
MOT PASS/Failure rate for 646 FKA
all MOT test results for 646 FKA represented as a percentage

PERCENTAGE OF VEHICLE FAULTS WITH 646 FKA

ALL REPORTED FAULTS, DISPLAYED BY PERCENTAGE OF OCCURRENCE DURING ALL MOT TESTS
PERCENTAGE OF VEHICLE FAULTS WITH 646 FKA
ALL REPORTED FAULTS, DISPLAYED BY PERCENTAGE OF OCCURRENCE DURING ALL MOT TESTS
ADVISORY

FAIL

USER ENTERED

PASS WITH RECTIFICATION

646 FKA annual Faults by type

ALL REPORTED FAULTS, DISPLAYED over time and categorised by type
646 FKA annual Faults by type
ALL REPORTED FAULTS, DISPLAYED over time and categorised by type

RECURRING FAULTS WITH 646 FKA

FAULTS THAT HAVE OCCURED MORE THAN ONCE DURING 646 FKA's MOT HISTORY
RECURRING FAULTS WITH 646 FKA
FAULTS THAT HAVE OCCURED MORE THAN ONCE DURING 646 FKA's MOT HISTORY
Fault Fault Test Date Test Date/Time Reference MOT Test Reference
2 Nearside rear suspension spring mounting prescribed area is corroded but not considered excessive (2.4.a.3) Nearside rear suspension spring mounting prescribed area is corroded but not considered excessive (2.4.a.3) 22 August 2014 [11:12] 22/08/2014 22 August 2014 [11:12] 22/08/2014 148134834239 148134834239 917364434269 917364434269
2 Full underbody regular protective sealant applied Full underbody regular protective sealant applied 22 August 2014 [11:12] 22/08/2014 22 August 2014 [11:12] 22/08/2014 148134834239 148134834239 917364434269 917364434269

ALL 646 FKA ADVISORIES [7]

ALL ADVISORIES, ORDERED by OCCURRENCE DURING 646 FKA's MOT HISTORY
ALL 646 FKA ADVISORIES [7]
ALL ADVISORIES, ORDERED by OCCURRENCE DURING 646 FKA's MOT HISTORY
Advisory Faults | source www.vehiclestats.co.uk
Fault Fault Test Date Test Date/Time Reference MOT Test Reference
2 Nearside rear suspension spring mounting prescribed area is corroded but not considered excessive (2.4.a.3) Nearside rear suspension spring mounting prescribed area is corroded but not considered excessive (2.4.a.3) 22 August 2014 [11:12] 22/08/2014 22 August 2014 [11:12] 22/08/2014 148134834239 148134834239 917364434269 917364434269
1 Front brake fluctuating, but not excessively (3.7.b.3) Front brake fluctuating, but not excessively (3.7.b.3) 14 October 2017 [09:12] 14/10/2017 182415527412 182415527412
1 Nearside rear slight misting of oil around brake backing plate Nearside rear slight misting of oil around brake backing plate 14 October 2017 [09:12] 14/10/2017 182415527412 182415527412
1 Vehicle structure has slight corrosion plated and protective coating applied (6.1.b.2) Vehicle structure has slight corrosion plated and protective coating applied (6.1.b.2) 27 September 2016 [12:03] 27/09/2016 305016199361 305016199361
1 Misting of oil around n/s rear brake backplate Misting of oil around n/s rear brake backplate 27 September 2016 [12:03] 27/09/2016 305016199361 305016199361
1 Body has slight corrosion (6.1.b.2) Body has slight corrosion (6.1.b.2) 04 September 2009 [09:53] 04/09/2009 900217549278 900217549278

ALL 646 FKA Failure Faults [3]

ALL Failure faults, ORDERED by OCCURRENCE DURING 646 FKA's MOT HISTORY
ALL 646 FKA Failure Faults [3]
ALL Failure faults, ORDERED by OCCURRENCE DURING 646 FKA's MOT HISTORY
Fail Faults | source www.vehiclestats.co.uk
Fault Fault Test Date Test Date/Time Reference MOT Test Reference
1 Offside front suspension component mounting prescribed area is excessively corroded chassis leg (2.4.a.3) Offside front suspension component mounting prescribed area is excessively corroded chassis leg (2.4.a.3) 02 September 2015 [11:19] 02/09/2015 110207803787 110207803787
1 Nearside rear suspension spring mounting prescribed area is excessively corroded (2.4.a.3) Nearside rear suspension spring mounting prescribed area is excessively corroded (2.4.a.3) 03 August 2006 [13:09] 03/08/2006 164425416241 164425416241
1 Offside front suspension component mounting prescribed area is excessively corroded (2.4.a.3) Offside front suspension component mounting prescribed area is excessively corroded (2.4.a.3) 03 August 2006 [13:09] 03/08/2006 164425416241 164425416241

ALL 646 FKA User Entered Faults [3]

ALL User Entered faults, ORDERED by OCCURRENCE DURING 646 FKA's MOT HISTORY
ALL 646 FKA User Entered Faults [3]
ALL User Entered faults, ORDERED by OCCURRENCE DURING 646 FKA's MOT HISTORY
Advisory Faults | source www.vehiclestats.co.uk
Fault Fault Test Date Test Date/Time Reference MOT Test Reference
2 Full underbody regular protective sealant applied Full underbody regular protective sealant applied 22 August 2014 [11:12] 22/08/2014 22 August 2014 [11:12] 22/08/2014 148134834239 148134834239 917364434269 917364434269
1 N/s rear axle halfshaft seal leaking N/s rear axle halfshaft seal leaking 04 September 2009 [09:53] 04/09/2009 900217549278 900217549278

ALL 646 FKA Pass With Rectification Faults [1]

ALL Pass With Rectification faults, ORDERED by OCCURRENCE DURING 646 FKA's MOT HISTORY
ALL 646 FKA Pass With Rectification Faults [1]
ALL Pass With Rectification faults, ORDERED by OCCURRENCE DURING 646 FKA's MOT HISTORY
Pass With Rectification Faults | source www.vehiclestats.co.uk
Fault Fault Test Date Test Date/Time Reference MOT Test Reference
1 Front windscreen washer provides insufficient washer liquid (8.2.3) Front windscreen washer provides insufficient washer liquid (8.2.3) 22 August 2014 [11:12] 22/08/2014 917364434269 917364434269

MOT TEST: 14 October 2017 09:12:36 PASSED
MOT TEST: 14 October 2017 09:12:36 PASSED

This test (182415527412) was completed on the 14 October 2017 09:12:36 and PASSED the requirements for a valid MOT with 2 comments.

This test (182415527412) was completed on the 14 October 2017 09:12:36 and PASSED the requirements for a valid MOT with 2 comments.

Recorded mileage: 21,811

Recorded mileage: 21,811


ADVISORY


MOT TEST: 27 September 2016 12:03:33 PASSED
MOT TEST: 27 September 2016 12:03:33 PASSED

This test (305016199361) was completed on the 27 September 2016 12:03:33 and PASSED the requirements for a valid MOT with 2 comments.

This test (305016199361) was completed on the 27 September 2016 12:03:33 and PASSED the requirements for a valid MOT with 2 comments.

Recorded mileage: 21,560

Recorded mileage: 21,560


ADVISORY


MOT TEST: 04 September 2015 11:51:16 PASSED
MOT TEST: 04 September 2015 11:51:16 PASSED

This test (201319251837) was completed on the 04 September 2015 11:51:16 and PASSED the requirements for a valid MOT with 0 comments.

This test (201319251837) was completed on the 04 September 2015 11:51:16 and PASSED the requirements for a valid MOT with 0 comments.

Recorded mileage: 20,770

Recorded mileage: 20,770


MOT TEST: 02 September 2015 11:19:18 FAILED
MOT TEST: 02 September 2015 11:19:18 FAILED

This test (110207803787) was completed on the 02 September 2015 11:19:18 and FAILED the requirements for a valid MOT with 1 comments.

This test (110207803787) was completed on the 02 September 2015 11:19:18 and FAILED the requirements for a valid MOT with 1 comments.

Recorded mileage: 20,764

Recorded mileage: 20,764


FAIL


MOT TEST: 22 August 2014 11:12:15 PASSED
MOT TEST: 22 August 2014 11:12:15 PASSED

This test (148134834239) was completed on the 22 August 2014 11:12:15 and PASSED the requirements for a valid MOT with 2 comments.

This test (148134834239) was completed on the 22 August 2014 11:12:15 and PASSED the requirements for a valid MOT with 2 comments.

Recorded mileage: 18,199

Recorded mileage: 18,199


ADVISORY

USER ENTERED


MOT TEST: 22 August 2014 11:12:15 FAILED
MOT TEST: 22 August 2014 11:12:15 FAILED

This test (917364434269) was completed on the 22 August 2014 11:12:15 and FAILED the requirements for a valid MOT with 3 comments.

This test (917364434269) was completed on the 22 August 2014 11:12:15 and FAILED the requirements for a valid MOT with 3 comments.

Recorded mileage: 18,199

Recorded mileage: 18,199


ADVISORY

USER ENTERED

PASS WITH RECTIFICATION


MOT TEST: 22 August 2013 14:42:06 PASSED
MOT TEST: 22 August 2013 14:42:06 PASSED

This test (836164433246) was completed on the 22 August 2013 14:42:06 and PASSED the requirements for a valid MOT with 0 comments.

This test (836164433246) was completed on the 22 August 2013 14:42:06 and PASSED the requirements for a valid MOT with 0 comments.

Recorded mileage: 16,308

Recorded mileage: 16,308


MOT TEST: 29 August 2012 16:00:37 PASSED
MOT TEST: 29 August 2012 16:00:37 PASSED

This test (949172142296) was completed on the 29 August 2012 16:00:37 and PASSED the requirements for a valid MOT with 0 comments.

This test (949172142296) was completed on the 29 August 2012 16:00:37 and PASSED the requirements for a valid MOT with 0 comments.

Recorded mileage: 14,217

Recorded mileage: 14,217


MOT TEST: 17 August 2011 12:11:20 PASSED
MOT TEST: 17 August 2011 12:11:20 PASSED

This test (118999621242) was completed on the 17 August 2011 12:11:20 and PASSED the requirements for a valid MOT with 0 comments.

This test (118999621242) was completed on the 17 August 2011 12:11:20 and PASSED the requirements for a valid MOT with 0 comments.

Recorded mileage: 12,165

Recorded mileage: 12,165


MOT TEST: 07 September 2010 13:36:44 PASSED
MOT TEST: 07 September 2010 13:36:44 PASSED

This test (251650850244) was completed on the 07 September 2010 13:36:44 and PASSED the requirements for a valid MOT with 0 comments.

This test (251650850244) was completed on the 07 September 2010 13:36:44 and PASSED the requirements for a valid MOT with 0 comments.

Recorded mileage: 10,091

Recorded mileage: 10,091


MOT TEST: 04 September 2009 09:53:32 PASSED
MOT TEST: 04 September 2009 09:53:32 PASSED

This test (900217549278) was completed on the 04 September 2009 09:53:32 and PASSED the requirements for a valid MOT with 2 comments.

This test (900217549278) was completed on the 04 September 2009 09:53:32 and PASSED the requirements for a valid MOT with 2 comments.

Recorded mileage: 7,674

Recorded mileage: 7,674


ADVISORY

USER ENTERED


MOT TEST: 05 September 2008 17:06:10 PASSED
MOT TEST: 05 September 2008 17:06:10 PASSED

This test (591269848291) was completed on the 05 September 2008 17:06:10 and PASSED the requirements for a valid MOT with 0 comments.

This test (591269848291) was completed on the 05 September 2008 17:06:10 and PASSED the requirements for a valid MOT with 0 comments.

Recorded mileage: 5,068

Recorded mileage: 5,068


MOT TEST: 11 September 2007 11:23:24 PASSED
MOT TEST: 11 September 2007 11:23:24 PASSED

This test (880774657273) was completed on the 11 September 2007 11:23:24 and PASSED the requirements for a valid MOT with 0 comments.

This test (880774657273) was completed on the 11 September 2007 11:23:24 and PASSED the requirements for a valid MOT with 0 comments.

Recorded mileage: 3,152

Recorded mileage: 3,152


MOT TEST: 13 September 2006 09:07:06 PASSED
MOT TEST: 13 September 2006 09:07:06 PASSED

This test (610816156231) was completed on the 13 September 2006 09:07:06 and PASSED the requirements for a valid MOT with 0 comments.

This test (610816156231) was completed on the 13 September 2006 09:07:06 and PASSED the requirements for a valid MOT with 0 comments.

Recorded mileage: 1,141

Recorded mileage: 1,141


MOT TEST: 03 August 2006 13:09:40 FAILED
MOT TEST: 03 August 2006 13:09:40 FAILED

This test (164425416241) was completed on the 03 August 2006 13:09:40 and FAILED the requirements for a valid MOT with 2 comments.

This test (164425416241) was completed on the 03 August 2006 13:09:40 and FAILED the requirements for a valid MOT with 2 comments.

Recorded mileage: 11,317

Recorded mileage: 11,317


FAIL