646 GWD


646GWD is registered to a Black 1963, Morris Minor traveller with a Petrol engine. It Failed its most recent MOT Test on the 28 June 2011

8 unique faults (8 Total) reported in its MOT History (2 Tests).

0 common/recurring faults.

50% (1) MOT Pass Rate and a 50% (1) MOT Failure Rate.

31,572 recorded miles.

646 GWD


646GWD is registered to a Black 1963, Morris Minor traveller with a Petrol engine. It Failed its most recent MOT Test on the 28 June 2011

8 unique faults (8 Total) reported in its MOT History (2 Tests).

0 common/recurring faults.

50% (1) MOT Pass Rate and a 50% (1) MOT Failure Rate.

31,572 recorded miles.

MOT PASS/Failure rate for 646 GWD

all MOT test results for 646 GWD represented as a percentage
MOT PASS/Failure rate for 646 GWD
all MOT test results for 646 GWD represented as a percentage

PERCENTAGE OF VEHICLE FAULTS WITH 646 GWD

ALL REPORTED FAULTS, DISPLAYED BY PERCENTAGE OF OCCURRENCE DURING ALL MOT TESTS
PERCENTAGE OF VEHICLE FAULTS WITH 646 GWD
ALL REPORTED FAULTS, DISPLAYED BY PERCENTAGE OF OCCURRENCE DURING ALL MOT TESTS
FAIL

646 GWD annual Faults by type

ALL REPORTED FAULTS, DISPLAYED over time and categorised by type
646 GWD annual Faults by type
ALL REPORTED FAULTS, DISPLAYED over time and categorised by type

ALL 646 GWD Failure Faults [8]

ALL Failure faults, ORDERED by OCCURRENCE DURING 646 GWD's MOT HISTORY
ALL 646 GWD Failure Faults [8]
ALL Failure faults, ORDERED by OCCURRENCE DURING 646 GWD's MOT HISTORY
Fail Faults | source www.vehiclestats.co.uk
Fault Fault Test Date Test Date/Time Reference MOT Test Reference
1 Offside rear suspension component mounting prescribed area is excessively corroded (2.4.a.3) Offside rear suspension component mounting prescribed area is excessively corroded (2.4.a.3) 25 June 2011 [09:18] 25/06/2011 958126371121 958126371121
1 Nearside rear suspension spring mounting prescribed area is excessively corroded (2.4.a.3) Nearside rear suspension spring mounting prescribed area is excessively corroded (2.4.a.3) 25 June 2011 [09:18] 25/06/2011 958126371121 958126371121
1 Offside rear suspension spring mounting prescribed area is excessively corroded (2.4.a.3) Offside rear suspension spring mounting prescribed area is excessively corroded (2.4.a.3) 25 June 2011 [09:18] 25/06/2011 958126371121 958126371121
1 Nearside inner rear suspension component mounting prescribed area is excessively corroded (2.4.a.3) Nearside inner rear suspension component mounting prescribed area is excessively corroded (2.4.a.3) 25 June 2011 [09:18] 25/06/2011 958126371121 958126371121
1 Offside outer front track rod end ball joint has excessive play (2.2.b.1f) Offside outer front track rod end ball joint has excessive play (2.2.b.1f) 25 June 2011 [09:18] 25/06/2011 958126371121 958126371121
1 Nearside front front wheel bearing has excessive play (2.5.a.3c) Nearside front front wheel bearing has excessive play (2.5.a.3c) 25 June 2011 [09:18] 25/06/2011 958126371121 958126371121
1 Offside front front wheel bearing has excessive play (2.5.a.3c) Offside front front wheel bearing has excessive play (2.5.a.3c) 25 June 2011 [09:18] 25/06/2011 958126371121 958126371121
1 Service brake: efficiency below requirements (3.7.b.7) Service brake: efficiency below requirements (3.7.b.7) 25 June 2011 [09:18] 25/06/2011 958126371121 958126371121

MOT TEST: 28 June 2011 10:01:46 PASSED
MOT TEST: 28 June 2011 10:01:46 PASSED

This test (786959671152) was completed on the 28 June 2011 10:01:46 and PASSED the requirements for a valid MOT with 0 comments.

This test (786959671152) was completed on the 28 June 2011 10:01:46 and PASSED the requirements for a valid MOT with 0 comments.

Recorded mileage: 31,572

Recorded mileage: 31,572


MOT TEST: 25 June 2011 09:18:58 FAILED
MOT TEST: 25 June 2011 09:18:58 FAILED

This test (958126371121) was completed on the 25 June 2011 09:18:58 and FAILED the requirements for a valid MOT with 8 comments.

This test (958126371121) was completed on the 25 June 2011 09:18:58 and FAILED the requirements for a valid MOT with 8 comments.

Recorded mileage: 31,565

Recorded mileage: 31,565


FAIL