654 UYK


654UYK is registered to a Black 1961, Morris Minor 1000 with a Petrol engine. It Failed its most recent MOT Test on the 15 October 2015

8 unique faults (11 Total) reported in its MOT History (9 Tests).

2 common/recurring faults, the most frequent (3 times) is: Nearside Front Suspension component mounting prescribed area is corroded but not considered excessive (2.4.A.3).

78% (7) MOT Pass Rate and a 22% (2) MOT Failure Rate.

90,552 recorded miles.

654 UYK


654UYK is registered to a Black 1961, Morris Minor 1000 with a Petrol engine. It Failed its most recent MOT Test on the 15 October 2015

8 unique faults (11 Total) reported in its MOT History (9 Tests).

2 common/recurring faults, the most frequent (3 times) is: Nearside Front Suspension component mounting prescribed area is corroded but not considered excessive (2.4.A.3).

78% (7) MOT Pass Rate and a 22% (2) MOT Failure Rate.

90,552 recorded miles.

MOT PASS/Failure rate for 654 UYK

all MOT test results for 654 UYK represented as a percentage
MOT PASS/Failure rate for 654 UYK
all MOT test results for 654 UYK represented as a percentage

PERCENTAGE OF VEHICLE FAULTS WITH 654 UYK

ALL REPORTED FAULTS, DISPLAYED BY PERCENTAGE OF OCCURRENCE DURING ALL MOT TESTS
PERCENTAGE OF VEHICLE FAULTS WITH 654 UYK
ALL REPORTED FAULTS, DISPLAYED BY PERCENTAGE OF OCCURRENCE DURING ALL MOT TESTS
ADVISORY

FAIL

USER ENTERED

654 UYK annual Faults by type

ALL REPORTED FAULTS, DISPLAYED over time and categorised by type
654 UYK annual Faults by type
ALL REPORTED FAULTS, DISPLAYED over time and categorised by type

RECURRING FAULTS WITH 654 UYK

FAULTS THAT HAVE OCCURED MORE THAN ONCE DURING 654 UYK's MOT HISTORY
RECURRING FAULTS WITH 654 UYK
FAULTS THAT HAVE OCCURED MORE THAN ONCE DURING 654 UYK's MOT HISTORY
Fault Fault Test Date Test Date/Time Reference MOT Test Reference
3 Nearside front suspension component mounting prescribed area is corroded but not considered excessive (2.4.a.3) Nearside front suspension component mounting prescribed area is corroded but not considered excessive (2.4.a.3) 15 April 2009 [09:00] 15/04/2009 30 November 2007 [16:15] 30/11/2007 22 November 2007 [11:05] 22/11/2007 204225509434 204225509434 630154937323 630154937323 741936427360 741936427360
2 Very little reserve travel in footbrake Very little reserve travel in footbrake 30 November 2007 [16:15] 30/11/2007 22 November 2007 [11:05] 22/11/2007 630154937323 630154937323 741936427360 741936427360

ALL 654 UYK ADVISORIES [4]

ALL ADVISORIES, ORDERED by OCCURRENCE DURING 654 UYK's MOT HISTORY
ALL 654 UYK ADVISORIES [4]
ALL ADVISORIES, ORDERED by OCCURRENCE DURING 654 UYK's MOT HISTORY
Advisory Faults | source www.vehiclestats.co.uk
Fault Fault Test Date Test Date/Time Reference MOT Test Reference
3 Nearside front suspension component mounting prescribed area is corroded but not considered excessive (2.4.a.3) Nearside front suspension component mounting prescribed area is corroded but not considered excessive (2.4.a.3) 15 April 2009 [09:00] 15/04/2009 30 November 2007 [16:15] 30/11/2007 22 November 2007 [11:05] 22/11/2007 204225509434 204225509434 630154937323 630154937323 741936427360 741936427360
1 Offside front suspension arm has slight play in a pin/bush (2.4.g.2) Offside front suspension arm has slight play in a pin/bush (2.4.g.2) 15 April 2009 [09:00] 15/04/2009 204225509434 204225509434

ALL 654 UYK Failure Faults [5]

ALL Failure faults, ORDERED by OCCURRENCE DURING 654 UYK's MOT HISTORY
ALL 654 UYK Failure Faults [5]
ALL Failure faults, ORDERED by OCCURRENCE DURING 654 UYK's MOT HISTORY
Fail Faults | source www.vehiclestats.co.uk
Fault Fault Test Date Test Date/Time Reference MOT Test Reference
1 Parking brake: efficiency below requirements (3.7.b.7) Parking brake: efficiency below requirements (3.7.b.7) 07 October 2015 [10:34] 07/10/2015 330120755394 330120755394
1 Rear brakes imbalanced across an axle axle 2 (3.7.b.5b) Rear brakes imbalanced across an axle axle 2 (3.7.b.5b) 07 October 2015 [10:34] 07/10/2015 330120755394 330120755394
1 Brakes imbalanced across an axle (3.7.b.5b) Brakes imbalanced across an axle (3.7.b.5b) 07 October 2015 [10:34] 07/10/2015 330120755394 330120755394
1 Nearside front upper suspension arm has excessive play in a pin/bush (2.4.g.2) Nearside front upper suspension arm has excessive play in a pin/bush (2.4.g.2) 07 October 2015 [10:34] 07/10/2015 330120755394 330120755394
1 Offside rear suspension spring mounting prescribed area is excessively corroded (2.4.a.3) Offside rear suspension spring mounting prescribed area is excessively corroded (2.4.a.3) 22 November 2007 [11:05] 22/11/2007 741936427360 741936427360

ALL 654 UYK User Entered Faults [2]

ALL User Entered faults, ORDERED by OCCURRENCE DURING 654 UYK's MOT HISTORY
ALL 654 UYK User Entered Faults [2]
ALL User Entered faults, ORDERED by OCCURRENCE DURING 654 UYK's MOT HISTORY
Advisory Faults | source www.vehiclestats.co.uk
Fault Fault Test Date Test Date/Time Reference MOT Test Reference
2 Very little reserve travel in footbrake Very little reserve travel in footbrake 30 November 2007 [16:15] 30/11/2007 22 November 2007 [11:05] 22/11/2007 630154937323 630154937323 741936427360 741936427360

MOT TEST: 15 October 2015 15:07:26 PASSED
MOT TEST: 15 October 2015 15:07:26 PASSED

This test (309617925767) was completed on the 15 October 2015 15:07:26 and PASSED the requirements for a valid MOT with 0 comments.

This test (309617925767) was completed on the 15 October 2015 15:07:26 and PASSED the requirements for a valid MOT with 0 comments.

Recorded mileage: 90,552

Recorded mileage: 90,552


MOT TEST: 07 October 2015 10:34:00 FAILED
MOT TEST: 07 October 2015 10:34:00 FAILED

This test (330120755394) was completed on the 07 October 2015 10:34:00 and FAILED the requirements for a valid MOT with 4 comments.

This test (330120755394) was completed on the 07 October 2015 10:34:00 and FAILED the requirements for a valid MOT with 4 comments.

Recorded mileage: 90,548

Recorded mileage: 90,548


FAIL


MOT TEST: 23 June 2014 13:28:49 PASSED
MOT TEST: 23 June 2014 13:28:49 PASSED

This test (736404074182) was completed on the 23 June 2014 13:28:49 and PASSED the requirements for a valid MOT with 0 comments.

This test (736404074182) was completed on the 23 June 2014 13:28:49 and PASSED the requirements for a valid MOT with 0 comments.

Recorded mileage: 88,406

Recorded mileage: 88,406


MOT TEST: 08 March 2013 09:54:59 PASSED
MOT TEST: 08 March 2013 09:54:59 PASSED

This test (786447863061) was completed on the 08 March 2013 09:54:59 and PASSED the requirements for a valid MOT with 0 comments.

This test (786447863061) was completed on the 08 March 2013 09:54:59 and PASSED the requirements for a valid MOT with 0 comments.

Recorded mileage: 86,570

Recorded mileage: 86,570


MOT TEST: 24 February 2012 10:20:49 PASSED
MOT TEST: 24 February 2012 10:20:49 PASSED

This test (577985352058) was completed on the 24 February 2012 10:20:49 and PASSED the requirements for a valid MOT with 0 comments.

This test (577985352058) was completed on the 24 February 2012 10:20:49 and PASSED the requirements for a valid MOT with 0 comments.

Recorded mileage: 44,822

Recorded mileage: 44,822


MOT TEST: 07 July 2010 09:03:11 PASSED
MOT TEST: 07 July 2010 09:03:11 PASSED

This test (992358280156) was completed on the 07 July 2010 09:03:11 and PASSED the requirements for a valid MOT with 0 comments.

This test (992358280156) was completed on the 07 July 2010 09:03:11 and PASSED the requirements for a valid MOT with 0 comments.

Recorded mileage: 43,107

Recorded mileage: 43,107


MOT TEST: 15 April 2009 09:00:52 PASSED
MOT TEST: 15 April 2009 09:00:52 PASSED

This test (204225509434) was completed on the 15 April 2009 09:00:52 and PASSED the requirements for a valid MOT with 2 comments.

This test (204225509434) was completed on the 15 April 2009 09:00:52 and PASSED the requirements for a valid MOT with 2 comments.

Recorded mileage: 30,524

Recorded mileage: 30,524


ADVISORY


MOT TEST: 30 November 2007 16:15:36 PASSED
MOT TEST: 30 November 2007 16:15:36 PASSED

This test (630154937323) was completed on the 30 November 2007 16:15:36 and PASSED the requirements for a valid MOT with 2 comments.

This test (630154937323) was completed on the 30 November 2007 16:15:36 and PASSED the requirements for a valid MOT with 2 comments.

Recorded mileage: 30,524

Recorded mileage: 30,524


ADVISORY

USER ENTERED


MOT TEST: 22 November 2007 11:05:52 FAILED
MOT TEST: 22 November 2007 11:05:52 FAILED

This test (741936427360) was completed on the 22 November 2007 11:05:52 and FAILED the requirements for a valid MOT with 3 comments.

This test (741936427360) was completed on the 22 November 2007 11:05:52 and FAILED the requirements for a valid MOT with 3 comments.

Recorded mileage: 30,524

Recorded mileage: 30,524


ADVISORY

FAIL

USER ENTERED