65HPX


65HPX is registered to a Grey 1963, Morris Minor 1000 with a Petrol engine. It Failed its most recent MOT Test on the 24 March 2011

8 unique faults (9 Total) reported in its MOT History (3 Tests).

1 common/recurring faults.

67% (2) MOT Pass Rate and a 33% (1) MOT Failure Rate.

19,948 recorded miles.

65HPX


65HPX is registered to a Grey 1963, Morris Minor 1000 with a Petrol engine. It Failed its most recent MOT Test on the 24 March 2011

8 unique faults (9 Total) reported in its MOT History (3 Tests).

1 common/recurring faults.

67% (2) MOT Pass Rate and a 33% (1) MOT Failure Rate.

19,948 recorded miles.

MOT PASS/Failure rate for 65HPX

all MOT test results for 65HPX represented as a percentage
MOT PASS/Failure rate for 65HPX
all MOT test results for 65HPX represented as a percentage

PERCENTAGE OF VEHICLE FAULTS WITH 65HPX

ALL REPORTED FAULTS, DISPLAYED BY PERCENTAGE OF OCCURRENCE DURING ALL MOT TESTS
PERCENTAGE OF VEHICLE FAULTS WITH 65HPX
ALL REPORTED FAULTS, DISPLAYED BY PERCENTAGE OF OCCURRENCE DURING ALL MOT TESTS
FAIL

USER ENTERED

65HPX annual Faults by type

ALL REPORTED FAULTS, DISPLAYED over time and categorised by type
65HPX annual Faults by type
ALL REPORTED FAULTS, DISPLAYED over time and categorised by type

ALL 65HPX Failure Faults [7]

ALL Failure faults, ORDERED by OCCURRENCE DURING 65HPX's MOT HISTORY
ALL 65HPX Failure Faults [7]
ALL Failure faults, ORDERED by OCCURRENCE DURING 65HPX's MOT HISTORY
Fail Faults | source www.vehiclestats.co.uk
Fault Fault Test Date Test Date/Time Reference MOT Test Reference
1 Nearside direction indicators not working (1.4.a.2c) Nearside direction indicators not working (1.4.a.2c) 16 March 2011 [13:11] 16/03/2011 569925571003 569925571003
1 Offside direction indicators not working (1.4.a.2c) Offside direction indicators not working (1.4.a.2c) 16 March 2011 [13:11] 16/03/2011 569925571003 569925571003
1 Nearside rear position lamp(s) not working (1.1.a.3b) Nearside rear position lamp(s) not working (1.1.a.3b) 16 March 2011 [13:11] 16/03/2011 569925571003 569925571003
1 Offside rear position lamp(s) not working (1.1.a.3b) Offside rear position lamp(s) not working (1.1.a.3b) 16 March 2011 [13:11] 16/03/2011 569925571003 569925571003
1 Registration plate lamp not working (1.1.c.1d) Registration plate lamp not working (1.1.c.1d) 16 March 2011 [13:11] 16/03/2011 569925571003 569925571003
1 Windscreen washer provides insufficient washer liquid (8.2.3) Windscreen washer provides insufficient washer liquid (8.2.3) 16 March 2011 [13:11] 16/03/2011 569925571003 569925571003
1 Nearside steering rack gaiter split (2.2.d.2d) Nearside steering rack gaiter split (2.2.d.2d) 16 March 2011 [13:11] 16/03/2011 569925571003 569925571003

ALL 65HPX User Entered Faults [2]

ALL User Entered faults, ORDERED by OCCURRENCE DURING 65HPX's MOT HISTORY
ALL 65HPX User Entered Faults [2]
ALL User Entered faults, ORDERED by OCCURRENCE DURING 65HPX's MOT HISTORY
User Entered Faults | source www.vehiclestats.co.uk
Fault Fault Test Date Test Date/Time Reference MOT Test Reference
2 Oil leak Oil leak 24 March 2011 [15:53] 24/03/2011 16 March 2011 [13:11] 16/03/2011 187543681445 187543681445 569925571003 569925571003

MOT TEST: 24 March 2011 15:53:45 PASSED
MOT TEST: 24 March 2011 15:53:45 PASSED

This test (187543681445) was completed on the 24 March 2011 15:53:45 and PASSED the requirements for a valid MOT with 1 comments.

This test (187543681445) was completed on the 24 March 2011 15:53:45 and PASSED the requirements for a valid MOT with 1 comments.

Recorded mileage: 19,948

Recorded mileage: 19,948


USER ENTERED


MOT TEST: 16 March 2011 13:11:44 FAILED
MOT TEST: 16 March 2011 13:11:44 FAILED

This test (569925571003) was completed on the 16 March 2011 13:11:44 and FAILED the requirements for a valid MOT with 8 comments.

This test (569925571003) was completed on the 16 March 2011 13:11:44 and FAILED the requirements for a valid MOT with 8 comments.

Recorded mileage: 19,948

Recorded mileage: 19,948


FAIL

USER ENTERED


MOT TEST: 16 April 2010 11:19:36 PASSED
MOT TEST: 16 April 2010 11:19:36 PASSED

This test (102206100190) was completed on the 16 April 2010 11:19:36 and PASSED the requirements for a valid MOT with 0 comments.

This test (102206100190) was completed on the 16 April 2010 11:19:36 and PASSED the requirements for a valid MOT with 0 comments.

Recorded mileage: 16,318

Recorded mileage: 16,318