660 AYA


660AYA is registered to a Grey 1957, Morris Minor 1000 with a Petrol engine. It Failed its most recent MOT Test on the 23 February 2010

9 unique faults (9 Total) reported in its MOT History (5 Tests).

0 common/recurring faults.

80% (4) MOT Pass Rate and a 20% (1) MOT Failure Rate.

53,085 recorded miles.

660 AYA


660AYA is registered to a Grey 1957, Morris Minor 1000 with a Petrol engine. It Failed its most recent MOT Test on the 23 February 2010

9 unique faults (9 Total) reported in its MOT History (5 Tests).

0 common/recurring faults.

80% (4) MOT Pass Rate and a 20% (1) MOT Failure Rate.

53,085 recorded miles.

MOT PASS/Failure rate for 660 AYA

all MOT test results for 660 AYA represented as a percentage
MOT PASS/Failure rate for 660 AYA
all MOT test results for 660 AYA represented as a percentage

PERCENTAGE OF VEHICLE FAULTS WITH 660 AYA

ALL REPORTED FAULTS, DISPLAYED BY PERCENTAGE OF OCCURRENCE DURING ALL MOT TESTS
PERCENTAGE OF VEHICLE FAULTS WITH 660 AYA
ALL REPORTED FAULTS, DISPLAYED BY PERCENTAGE OF OCCURRENCE DURING ALL MOT TESTS
ADVISORY

FAIL

USER ENTERED

660 AYA annual Faults by type

ALL REPORTED FAULTS, DISPLAYED over time and categorised by type
660 AYA annual Faults by type
ALL REPORTED FAULTS, DISPLAYED over time and categorised by type

ALL 660 AYA ADVISORIES [5]

ALL ADVISORIES, ORDERED by OCCURRENCE DURING 660 AYA's MOT HISTORY
ALL 660 AYA ADVISORIES [5]
ALL ADVISORIES, ORDERED by OCCURRENCE DURING 660 AYA's MOT HISTORY
Advisory Faults | source www.vehiclestats.co.uk
Fault Fault Test Date Test Date/Time Reference MOT Test Reference
1 Nearside front brake pipe slightly corroded (3.6.b.2c) Nearside front brake pipe slightly corroded (3.6.b.2c) 23 February 2010 [12:38] 23/02/2010 294184350019 294184350019
1 Offside front brake pipe slightly corroded (3.6.b.2c) Offside front brake pipe slightly corroded (3.6.b.2c) 23 February 2010 [12:38] 23/02/2010 294184350019 294184350019
1 Offside front body has slight corrosion (6.1.b.2) Offside front body has slight corrosion (6.1.b.2) 23 February 2010 [12:38] 23/02/2010 294184350019 294184350019
1 Service brake: service brake efficiency only just met. It would appear that the braking system requires adjustment or repair. (3.7.b.7) Service brake: service brake efficiency only just met. It would appear that the braking system requires adjustment or repair. (3.7.b.7) 23 February 2010 [12:38] 23/02/2010 294184350019 294184350019
1 Brakes imbalanced requirements only just met. It would appear that the braking system requires adjustment or repair. (3.7.b.5b) Brakes imbalanced requirements only just met. It would appear that the braking system requires adjustment or repair. (3.7.b.5b) 23 February 2010 [12:38] 23/02/2010 294184350019 294184350019

ALL 660 AYA Failure Faults [1]

ALL Failure faults, ORDERED by OCCURRENCE DURING 660 AYA's MOT HISTORY
ALL 660 AYA Failure Faults [1]
ALL Failure faults, ORDERED by OCCURRENCE DURING 660 AYA's MOT HISTORY
Fail Faults | source www.vehiclestats.co.uk
Fault Fault Test Date Test Date/Time Reference MOT Test Reference
1 Nearside front vehicle structure has excessive corrosion which adversely affects braking or steering (6.1.a.1) Nearside front vehicle structure has excessive corrosion which adversely affects braking or steering (6.1.a.1) 27 February 2006 [12:58] 27/02/2006 620208956017 620208956017

ALL 660 AYA User Entered Faults [3]

ALL User Entered faults, ORDERED by OCCURRENCE DURING 660 AYA's MOT HISTORY
ALL 660 AYA User Entered Faults [3]
ALL User Entered faults, ORDERED by OCCURRENCE DURING 660 AYA's MOT HISTORY
Advisory Faults | source www.vehiclestats.co.uk
Fault Fault Test Date Test Date/Time Reference MOT Test Reference
1 Brake pedal a little spongy Brake pedal a little spongy 23 February 2010 [12:38] 23/02/2010 294184350019 294184350019
1 All rear suspension bush's cracked All rear suspension bush's cracked 23 February 2010 [12:38] 23/02/2010 294184350019 294184350019
1 Nearside/offside jacking points have slight corrosion Nearside/offside jacking points have slight corrosion 23 February 2010 [12:38] 23/02/2010 294184350019 294184350019

MOT TEST: 23 February 2010 12:38:44 PASSED
MOT TEST: 23 February 2010 12:38:44 PASSED

This test (294184350019) was completed on the 23 February 2010 12:38:44 and PASSED the requirements for a valid MOT with 8 comments.

This test (294184350019) was completed on the 23 February 2010 12:38:44 and PASSED the requirements for a valid MOT with 8 comments.

Recorded mileage: 53,085

Recorded mileage: 53,085


ADVISORY

USER ENTERED


MOT TEST: 12 May 2008 10:35:45 PASSED
MOT TEST: 12 May 2008 10:35:45 PASSED

This test (264943838146) was completed on the 12 May 2008 10:35:45 and PASSED the requirements for a valid MOT with 0 comments.

This test (264943838146) was completed on the 12 May 2008 10:35:45 and PASSED the requirements for a valid MOT with 0 comments.

Recorded mileage: 53,057

Recorded mileage: 53,057


MOT TEST: 26 February 2007 11:25:52 PASSED
MOT TEST: 26 February 2007 11:25:52 PASSED

This test (880637957045) was completed on the 26 February 2007 11:25:52 and PASSED the requirements for a valid MOT with 0 comments.

This test (880637957045) was completed on the 26 February 2007 11:25:52 and PASSED the requirements for a valid MOT with 0 comments.

Recorded mileage: 53,036

Recorded mileage: 53,036


MOT TEST: 03 March 2006 09:27:37 PASSED
MOT TEST: 03 March 2006 09:27:37 PASSED

This test (630452466082) was completed on the 03 March 2006 09:27:37 and PASSED the requirements for a valid MOT with 0 comments.

This test (630452466082) was completed on the 03 March 2006 09:27:37 and PASSED the requirements for a valid MOT with 0 comments.

Recorded mileage: 53,005

Recorded mileage: 53,005


MOT TEST: 27 February 2006 12:58:49 FAILED
MOT TEST: 27 February 2006 12:58:49 FAILED

This test (620208956017) was completed on the 27 February 2006 12:58:49 and FAILED the requirements for a valid MOT with 1 comments.

This test (620208956017) was completed on the 27 February 2006 12:58:49 and FAILED the requirements for a valid MOT with 1 comments.

Recorded mileage: 52,998

Recorded mileage: 52,998


FAIL