660 UXJ


660UXJ is registered to a Green 1956, Morris Minor with a Petrol engine. It Failed its most recent MOT Test on the 18 June 2012

4 unique faults (4 Total) reported in its MOT History (8 Tests).

0 common/recurring faults.

75% (6) MOT Pass Rate and a 25% (2) MOT Failure Rate.

59,204 recorded miles.

660 UXJ


660UXJ is registered to a Green 1956, Morris Minor with a Petrol engine. It Failed its most recent MOT Test on the 18 June 2012

4 unique faults (4 Total) reported in its MOT History (8 Tests).

0 common/recurring faults.

75% (6) MOT Pass Rate and a 25% (2) MOT Failure Rate.

59,204 recorded miles.

MOT PASS/Failure rate for 660 UXJ

all MOT test results for 660 UXJ represented as a percentage
MOT PASS/Failure rate for 660 UXJ
all MOT test results for 660 UXJ represented as a percentage

PERCENTAGE OF VEHICLE FAULTS WITH 660 UXJ

ALL REPORTED FAULTS, DISPLAYED BY PERCENTAGE OF OCCURRENCE DURING ALL MOT TESTS
PERCENTAGE OF VEHICLE FAULTS WITH 660 UXJ
ALL REPORTED FAULTS, DISPLAYED BY PERCENTAGE OF OCCURRENCE DURING ALL MOT TESTS
FAIL

660 UXJ annual Faults by type

ALL REPORTED FAULTS, DISPLAYED over time and categorised by type
660 UXJ annual Faults by type
ALL REPORTED FAULTS, DISPLAYED over time and categorised by type

ALL 660 UXJ Failure Faults [4]

ALL Failure faults, ORDERED by OCCURRENCE DURING 660 UXJ's MOT HISTORY
ALL 660 UXJ Failure Faults [4]
ALL Failure faults, ORDERED by OCCURRENCE DURING 660 UXJ's MOT HISTORY
Fail Faults | source www.vehiclestats.co.uk
Fault Fault Test Date Test Date/Time Reference MOT Test Reference
1 Nearside front suspension arm rubber bush deteriorated resulting in excessive movement (2.4.g.2) Nearside front suspension arm rubber bush deteriorated resulting in excessive movement (2.4.g.2) 24 June 2011 [11:42] 24/06/2011 668365771100 668365771100
1 Nearside headlamp aim too high (1.8) Nearside headlamp aim too high (1.8) 19 February 2008 [12:55] 19/02/2008 174640258485 174640258485
1 Offside headlamp aim too high (1.8) Offside headlamp aim too high (1.8) 19 February 2008 [12:55] 19/02/2008 174640258485 174640258485
1 Exhaust emits clearly visible black smoke during acceleration (7.3.a.2c) Exhaust emits clearly visible black smoke during acceleration (7.3.a.2c) 19 February 2008 [12:55] 19/02/2008 174640258485 174640258485

MOT TEST: 18 June 2012 16:52:30 PASSED
MOT TEST: 18 June 2012 16:52:30 PASSED

This test (498160572132) was completed on the 18 June 2012 16:52:30 and PASSED the requirements for a valid MOT with 0 comments.

This test (498160572132) was completed on the 18 June 2012 16:52:30 and PASSED the requirements for a valid MOT with 0 comments.

Recorded mileage: 59,204

Recorded mileage: 59,204


MOT TEST: 27 June 2011 09:27:48 PASSED
MOT TEST: 27 June 2011 09:27:48 PASSED

This test (919828171169) was completed on the 27 June 2011 09:27:48 and PASSED the requirements for a valid MOT with 0 comments.

This test (919828171169) was completed on the 27 June 2011 09:27:48 and PASSED the requirements for a valid MOT with 0 comments.

Recorded mileage: 58,978

Recorded mileage: 58,978


MOT TEST: 24 June 2011 11:42:45 FAILED
MOT TEST: 24 June 2011 11:42:45 FAILED

This test (668365771100) was completed on the 24 June 2011 11:42:45 and FAILED the requirements for a valid MOT with 1 comments.

This test (668365771100) was completed on the 24 June 2011 11:42:45 and FAILED the requirements for a valid MOT with 1 comments.

Recorded mileage: 58,976

Recorded mileage: 58,976


FAIL


MOT TEST: 30 June 2010 16:27:20 PASSED
MOT TEST: 30 June 2010 16:27:20 PASSED

This test (231521280457) was completed on the 30 June 2010 16:27:20 and PASSED the requirements for a valid MOT with 0 comments.

This test (231521280457) was completed on the 30 June 2010 16:27:20 and PASSED the requirements for a valid MOT with 0 comments.

Recorded mileage: 58,762

Recorded mileage: 58,762


MOT TEST: 20 February 2009 16:32:00 PASSED
MOT TEST: 20 February 2009 16:32:00 PASSED

This test (152411759054) was completed on the 20 February 2009 16:32:00 and PASSED the requirements for a valid MOT with 0 comments.

This test (152411759054) was completed on the 20 February 2009 16:32:00 and PASSED the requirements for a valid MOT with 0 comments.

Recorded mileage: 58,575

Recorded mileage: 58,575


MOT TEST: 20 February 2008 09:32:47 PASSED
MOT TEST: 20 February 2008 09:32:47 PASSED

This test (973351558060) was completed on the 20 February 2008 09:32:47 and PASSED the requirements for a valid MOT with 0 comments.

This test (973351558060) was completed on the 20 February 2008 09:32:47 and PASSED the requirements for a valid MOT with 0 comments.

Recorded mileage: 58,526

Recorded mileage: 58,526


MOT TEST: 19 February 2008 12:55:19 FAILED
MOT TEST: 19 February 2008 12:55:19 FAILED

This test (174640258485) was completed on the 19 February 2008 12:55:19 and FAILED the requirements for a valid MOT with 3 comments.

This test (174640258485) was completed on the 19 February 2008 12:55:19 and FAILED the requirements for a valid MOT with 3 comments.

Recorded mileage: 58,520

Recorded mileage: 58,520


FAIL


MOT TEST: 10 July 2006 15:49:11 PASSED
MOT TEST: 10 July 2006 15:49:11 PASSED

This test (972551696196) was completed on the 10 July 2006 15:49:11 and PASSED the requirements for a valid MOT with 0 comments.

This test (972551696196) was completed on the 10 July 2006 15:49:11 and PASSED the requirements for a valid MOT with 0 comments.

Recorded mileage: 58,474

Recorded mileage: 58,474