661 9FN


6619FN is registered to a Blue 1963, Morris Minor 1000 with a Petrol engine. It Failed its most recent MOT Test on the 10 April 2018

18 unique faults (20 Total) reported in its MOT History (18 Tests).

1 common/recurring faults.

67% (12) MOT Pass Rate and a 33% (6) MOT Failure Rate.

19,230 recorded miles.

661 9FN


6619FN is registered to a Blue 1963, Morris Minor 1000 with a Petrol engine. It Failed its most recent MOT Test on the 10 April 2018

18 unique faults (20 Total) reported in its MOT History (18 Tests).

1 common/recurring faults.

67% (12) MOT Pass Rate and a 33% (6) MOT Failure Rate.

19,230 recorded miles.

MOT PASS/Failure rate for 661 9FN

all MOT test results for 661 9FN represented as a percentage
MOT PASS/Failure rate for 661 9FN
all MOT test results for 661 9FN represented as a percentage

PERCENTAGE OF VEHICLE FAULTS WITH 661 9FN

ALL REPORTED FAULTS, DISPLAYED BY PERCENTAGE OF OCCURRENCE DURING ALL MOT TESTS
PERCENTAGE OF VEHICLE FAULTS WITH 661 9FN
ALL REPORTED FAULTS, DISPLAYED BY PERCENTAGE OF OCCURRENCE DURING ALL MOT TESTS
ADVISORY

FAIL

661 9FN annual Faults by type

ALL REPORTED FAULTS, DISPLAYED over time and categorised by type
661 9FN annual Faults by type
ALL REPORTED FAULTS, DISPLAYED over time and categorised by type

ALL 661 9FN ADVISORIES [3]

ALL ADVISORIES, ORDERED by OCCURRENCE DURING 661 9FN's MOT HISTORY
ALL 661 9FN ADVISORIES [3]
ALL ADVISORIES, ORDERED by OCCURRENCE DURING 661 9FN's MOT HISTORY
Advisory Faults | source www.vehiclestats.co.uk
Fault Fault Test Date Test Date/Time Reference MOT Test Reference
1 Offside front front wheel bearing has slight play (2.5.a.3c) Offside front front wheel bearing has slight play (2.5.a.3c) 29 November 2011 [12:36] 29/11/2011 957723831397 957723831397
1 Nearside front lower axle king pin has slight play in pin and/or bush (2.5.a.3a) Nearside front lower axle king pin has slight play in pin and/or bush (2.5.a.3a) 01 December 2009 [11:17] 01/12/2009 420915339334 420915339334
1 Offside front lower axle king pin has slight play in pin and/or bush (2.5.a.3a) Offside front lower axle king pin has slight play in pin and/or bush (2.5.a.3a) 01 December 2009 [11:17] 01/12/2009 420915339334 420915339334

ALL 661 9FN Failure Faults [17]

ALL Failure faults, ORDERED by OCCURRENCE DURING 661 9FN's MOT HISTORY
ALL 661 9FN Failure Faults [17]
ALL Failure faults, ORDERED by OCCURRENCE DURING 661 9FN's MOT HISTORY
Fail Faults | source www.vehiclestats.co.uk
Fault Fault Test Date Test Date/Time Reference MOT Test Reference
2 Windscreen washer provides insufficient washer liquid (8.2.3) Windscreen washer provides insufficient washer liquid (8.2.3) 09 December 2014 [09:58] 09/12/2014 01 December 2010 [11:15] 01/12/2010 467533944478 467533944478 560415130319 560415130319
1 Offside front brake hose twisted (found during steering lock to lock check) (2.2.d.2b) Offside front brake hose twisted (found during steering lock to lock check) (2.2.d.2b) 19 April 2017 [11:47] 19/04/2017 782013289484 782013289484
1 Nearside rear parking brake recording little or no effort (3.7.b.6a) Nearside rear parking brake recording little or no effort (3.7.b.6a) 19 April 2017 [11:47] 19/04/2017 782013289484 782013289484
1 Parking brake: efficiency below requirements (3.7.b.7) Parking brake: efficiency below requirements (3.7.b.7) 19 April 2017 [11:47] 19/04/2017 782013289484 782013289484
1 Nearside rear brake pipe leaking (3.6.a.1) Nearside rear brake pipe leaking (3.6.a.1) 17 November 2015 [12:20] 17/11/2015 905420908162 905420908162
1 Nearside front tie bar/rod insecure (2.4.g.1) Nearside front tie bar/rod insecure (2.4.g.1) 17 November 2015 [12:20] 17/11/2015 905420908162 905420908162
1 Nearside front front brake binding (3.7.b.1) Nearside front front brake binding (3.7.b.1) 09 December 2014 [09:58] 09/12/2014 467533944478 467533944478
1 Nearside rear front brake recording little or no effort (3.7.b.5a) Nearside rear front brake recording little or no effort (3.7.b.5a) 09 December 2014 [09:58] 09/12/2014 467533944478 467533944478
1 Nearside rear front brake binding (3.7.b.1) Nearside rear front brake binding (3.7.b.1) 09 December 2014 [09:58] 09/12/2014 467533944478 467533944478
1 Brakes imbalanced across an axle (3.7.b.5b) Brakes imbalanced across an axle (3.7.b.5b) 09 December 2014 [09:58] 09/12/2014 467533944478 467533944478
1 Horn not working (1.6.2a) Horn not working (1.6.2a) 01 December 2010 [11:15] 01/12/2010 560415130319 560415130319
1 Nearside rear suspension spring mounting prescribed area is excessively corroded (2.4.a.3) Nearside rear suspension spring mounting prescribed area is excessively corroded (2.4.a.3) 27 November 2008 [16:29] 27/11/2008 403992038356 403992038356
1 Offside rear suspension spring mounting prescribed area is excessively corroded (2.4.a.3) Offside rear suspension spring mounting prescribed area is excessively corroded (2.4.a.3) 27 November 2008 [16:29] 27/11/2008 403992038356 403992038356
1 Nearside stop lamp not working (1.2.1b) Nearside stop lamp not working (1.2.1b) 30 March 2007 [13:03] 30/03/2007 293969187002 293969187002
1 Offside stop lamp not working (1.2.1b) Offside stop lamp not working (1.2.1b) 30 March 2007 [13:03] 30/03/2007 293969187002 293969187002

MOT TEST: 10 April 2018 10:11:30 PASSED
MOT TEST: 10 April 2018 10:11:30 PASSED

This test (374667052897) was completed on the 10 April 2018 10:11:30 and PASSED the requirements for a valid MOT with 0 comments.

This test (374667052897) was completed on the 10 April 2018 10:11:30 and PASSED the requirements for a valid MOT with 0 comments.

Recorded mileage: 19,230

Recorded mileage: 19,230


MOT TEST: 19 April 2017 14:29:54 PASSED
MOT TEST: 19 April 2017 14:29:54 PASSED

This test (606819471903) was completed on the 19 April 2017 14:29:54 and PASSED the requirements for a valid MOT with 0 comments.

This test (606819471903) was completed on the 19 April 2017 14:29:54 and PASSED the requirements for a valid MOT with 0 comments.

Recorded mileage: 18,710

Recorded mileage: 18,710


MOT TEST: 19 April 2017 11:47:12 FAILED
MOT TEST: 19 April 2017 11:47:12 FAILED

This test (782013289484) was completed on the 19 April 2017 11:47:12 and FAILED the requirements for a valid MOT with 3 comments.

This test (782013289484) was completed on the 19 April 2017 11:47:12 and FAILED the requirements for a valid MOT with 3 comments.

Recorded mileage: 18,710

Recorded mileage: 18,710


FAIL


MOT TEST: 17 November 2015 15:53:53 PASSED
MOT TEST: 17 November 2015 15:53:53 PASSED

This test (199266726077) was completed on the 17 November 2015 15:53:53 and PASSED the requirements for a valid MOT with 0 comments.

This test (199266726077) was completed on the 17 November 2015 15:53:53 and PASSED the requirements for a valid MOT with 0 comments.

Recorded mileage: 17,563

Recorded mileage: 17,563


MOT TEST: 17 November 2015 12:20:30 FAILED
MOT TEST: 17 November 2015 12:20:30 FAILED

This test (905420908162) was completed on the 17 November 2015 12:20:30 and FAILED the requirements for a valid MOT with 2 comments.

This test (905420908162) was completed on the 17 November 2015 12:20:30 and FAILED the requirements for a valid MOT with 2 comments.

Recorded mileage: 17,563

Recorded mileage: 17,563


FAIL


MOT TEST: 11 December 2014 10:39:21 PASSED
MOT TEST: 11 December 2014 10:39:21 PASSED

This test (865655244399) was completed on the 11 December 2014 10:39:21 and PASSED the requirements for a valid MOT with 0 comments.

This test (865655244399) was completed on the 11 December 2014 10:39:21 and PASSED the requirements for a valid MOT with 0 comments.

Recorded mileage: 16,761

Recorded mileage: 16,761


MOT TEST: 09 December 2014 09:58:01 FAILED
MOT TEST: 09 December 2014 09:58:01 FAILED

This test (467533944478) was completed on the 09 December 2014 09:58:01 and FAILED the requirements for a valid MOT with 5 comments.

This test (467533944478) was completed on the 09 December 2014 09:58:01 and FAILED the requirements for a valid MOT with 5 comments.

Recorded mileage: 16,761

Recorded mileage: 16,761


FAIL


MOT TEST: 05 December 2013 14:44:36 PASSED
MOT TEST: 05 December 2013 14:44:36 PASSED

This test (236189033328) was completed on the 05 December 2013 14:44:36 and PASSED the requirements for a valid MOT with 0 comments.

This test (236189033328) was completed on the 05 December 2013 14:44:36 and PASSED the requirements for a valid MOT with 0 comments.

Recorded mileage: 16,248

Recorded mileage: 16,248


MOT TEST: 14 December 2012 11:59:54 PASSED
MOT TEST: 14 December 2012 11:59:54 PASSED

This test (498709442430) was completed on the 14 December 2012 11:59:54 and PASSED the requirements for a valid MOT with 0 comments.

This test (498709442430) was completed on the 14 December 2012 11:59:54 and PASSED the requirements for a valid MOT with 0 comments.

Recorded mileage: 14,451

Recorded mileage: 14,451


MOT TEST: 29 November 2011 12:36:48 PASSED
MOT TEST: 29 November 2011 12:36:48 PASSED

This test (957723831397) was completed on the 29 November 2011 12:36:48 and PASSED the requirements for a valid MOT with 1 comments.

This test (957723831397) was completed on the 29 November 2011 12:36:48 and PASSED the requirements for a valid MOT with 1 comments.

Recorded mileage: 12,712

Recorded mileage: 12,712


ADVISORY


MOT TEST: 01 December 2010 11:39:16 PASSED
MOT TEST: 01 December 2010 11:39:16 PASSED

This test (883705130304) was completed on the 01 December 2010 11:39:16 and PASSED the requirements for a valid MOT with 0 comments.

This test (883705130304) was completed on the 01 December 2010 11:39:16 and PASSED the requirements for a valid MOT with 0 comments.

Recorded mileage: 11,649

Recorded mileage: 11,649


MOT TEST: 01 December 2010 11:15:08 FAILED
MOT TEST: 01 December 2010 11:15:08 FAILED

This test (560415130319) was completed on the 01 December 2010 11:15:08 and FAILED the requirements for a valid MOT with 2 comments.

This test (560415130319) was completed on the 01 December 2010 11:15:08 and FAILED the requirements for a valid MOT with 2 comments.

Recorded mileage: 11,649

Recorded mileage: 11,649


FAIL


MOT TEST: 01 December 2009 11:17:53 PASSED
MOT TEST: 01 December 2009 11:17:53 PASSED

This test (420915339334) was completed on the 01 December 2009 11:17:53 and PASSED the requirements for a valid MOT with 2 comments.

This test (420915339334) was completed on the 01 December 2009 11:17:53 and PASSED the requirements for a valid MOT with 2 comments.

Recorded mileage: 10,551

Recorded mileage: 10,551


ADVISORY


MOT TEST: 10 December 2008 09:03:23 PASSED
MOT TEST: 10 December 2008 09:03:23 PASSED

This test (830115348328) was completed on the 10 December 2008 09:03:23 and PASSED the requirements for a valid MOT with 0 comments.

This test (830115348328) was completed on the 10 December 2008 09:03:23 and PASSED the requirements for a valid MOT with 0 comments.

Recorded mileage: 9,500

Recorded mileage: 9,500


MOT TEST: 27 November 2008 16:29:02 FAILED
MOT TEST: 27 November 2008 16:29:02 FAILED

This test (403992038356) was completed on the 27 November 2008 16:29:02 and FAILED the requirements for a valid MOT with 3 comments.

This test (403992038356) was completed on the 27 November 2008 16:29:02 and FAILED the requirements for a valid MOT with 3 comments.

Recorded mileage: 9,500

Recorded mileage: 9,500


FAIL


MOT TEST: 03 April 2007 09:30:38 PASSED
MOT TEST: 03 April 2007 09:30:38 PASSED

This test (331233197066) was completed on the 03 April 2007 09:30:38 and PASSED the requirements for a valid MOT with 0 comments.

This test (331233197066) was completed on the 03 April 2007 09:30:38 and PASSED the requirements for a valid MOT with 0 comments.

Recorded mileage: 7,833

Recorded mileage: 7,833


MOT TEST: 30 March 2007 13:03:04 FAILED
MOT TEST: 30 March 2007 13:03:04 FAILED

This test (293969187002) was completed on the 30 March 2007 13:03:04 and FAILED the requirements for a valid MOT with 2 comments.

This test (293969187002) was completed on the 30 March 2007 13:03:04 and FAILED the requirements for a valid MOT with 2 comments.

Recorded mileage: 7,833

Recorded mileage: 7,833


FAIL


MOT TEST: 19 April 2006 10:04:59 PASSED
MOT TEST: 19 April 2006 10:04:59 PASSED

This test (203259306400) was completed on the 19 April 2006 10:04:59 and PASSED the requirements for a valid MOT with 0 comments.

This test (203259306400) was completed on the 19 April 2006 10:04:59 and PASSED the requirements for a valid MOT with 0 comments.

Recorded mileage: 7,218

Recorded mileage: 7,218