664 UBB


664UBB is registered to a Green 1962, Morris with a Petrol engine. It Failed its most recent MOT Test on the 15 July 2016

11 unique faults (14 Total) reported in its MOT History (4 Tests).

2 common/recurring faults, the most frequent (3 times) is: Steering system has slight free play detected at steering wheel (2.2.A.1b).

75% (3) MOT Pass Rate and a 25% (1) MOT Failure Rate.

51,030 recorded miles.

664 UBB


664UBB is registered to a Green 1962, Morris with a Petrol engine. It Failed its most recent MOT Test on the 15 July 2016

11 unique faults (14 Total) reported in its MOT History (4 Tests).

2 common/recurring faults, the most frequent (3 times) is: Steering system has slight free play detected at steering wheel (2.2.A.1b).

75% (3) MOT Pass Rate and a 25% (1) MOT Failure Rate.

51,030 recorded miles.

MOT PASS/Failure rate for 664 UBB

all MOT test results for 664 UBB represented as a percentage
MOT PASS/Failure rate for 664 UBB
all MOT test results for 664 UBB represented as a percentage

PERCENTAGE OF VEHICLE FAULTS WITH 664 UBB

ALL REPORTED FAULTS, DISPLAYED BY PERCENTAGE OF OCCURRENCE DURING ALL MOT TESTS
PERCENTAGE OF VEHICLE FAULTS WITH 664 UBB
ALL REPORTED FAULTS, DISPLAYED BY PERCENTAGE OF OCCURRENCE DURING ALL MOT TESTS
ADVISORY

FAIL

USER ENTERED

664 UBB annual Faults by type

ALL REPORTED FAULTS, DISPLAYED over time and categorised by type
664 UBB annual Faults by type
ALL REPORTED FAULTS, DISPLAYED over time and categorised by type

RECURRING FAULTS WITH 664 UBB

FAULTS THAT HAVE OCCURED MORE THAN ONCE DURING 664 UBB's MOT HISTORY
RECURRING FAULTS WITH 664 UBB
FAULTS THAT HAVE OCCURED MORE THAN ONCE DURING 664 UBB's MOT HISTORY
Fault Fault Test Date Test Date/Time Reference MOT Test Reference
3 Steering system has slight free play detected at steering wheel (2.2.a.1b) Steering system has slight free play detected at steering wheel (2.2.a.1b) 15 July 2016 [14:57] 15/07/2016 05 August 2015 [14:47] 05/08/2015 30 July 2015 [16:31] 30/07/2015 907188451984 907188451984 697847415227 697847415227 598871615299 598871615299
2 Coolant leak Coolant leak 05 August 2015 [14:47] 05/08/2015 30 July 2015 [16:31] 30/07/2015 697847415227 697847415227 598871615299 598871615299

ALL 664 UBB ADVISORIES [4]

ALL ADVISORIES, ORDERED by OCCURRENCE DURING 664 UBB's MOT HISTORY
ALL 664 UBB ADVISORIES [4]
ALL ADVISORIES, ORDERED by OCCURRENCE DURING 664 UBB's MOT HISTORY
Advisory Faults | source www.vehiclestats.co.uk
Fault Fault Test Date Test Date/Time Reference MOT Test Reference
3 Steering system has slight free play detected at steering wheel (2.2.a.1b) Steering system has slight free play detected at steering wheel (2.2.a.1b) 15 July 2016 [14:57] 15/07/2016 05 August 2015 [14:47] 05/08/2015 30 July 2015 [16:31] 30/07/2015 907188451984 907188451984 697847415227 697847415227 598871615299 598871615299
1 Front service brake: service brake efficiency only just met. It would appear that the braking system requires adjustment or repair. (3.7.b.7) Front service brake: service brake efficiency only just met. It would appear that the braking system requires adjustment or repair. (3.7.b.7) 22 August 2013 [16:45] 22/08/2013 407574533280 407574533280

ALL 664 UBB Failure Faults [8]

ALL Failure faults, ORDERED by OCCURRENCE DURING 664 UBB's MOT HISTORY
ALL 664 UBB Failure Faults [8]
ALL Failure faults, ORDERED by OCCURRENCE DURING 664 UBB's MOT HISTORY
Fail Faults | source www.vehiclestats.co.uk
Fault Fault Test Date Test Date/Time Reference MOT Test Reference
1 Front brakes imbalanced across an axle (3.7.b.5b) Front brakes imbalanced across an axle (3.7.b.5b) 30 July 2015 [16:31] 30/07/2015 598871615299 598871615299
1 Offside front position lamp(s) not working (1.1.a.3b) Offside front position lamp(s) not working (1.1.a.3b) 30 July 2015 [16:31] 30/07/2015 598871615299 598871615299
1 Windscreen washer provides insufficient washer liquid (8.2.3) Windscreen washer provides insufficient washer liquid (8.2.3) 30 July 2015 [16:31] 30/07/2015 598871615299 598871615299
1 Direction indicators not working (1.4.a.2c) Direction indicators not working (1.4.a.2c) 30 July 2015 [16:31] 30/07/2015 598871615299 598871615299
1 Nearside rear brake recording little or no effort (3.7.b.5a) Nearside rear brake recording little or no effort (3.7.b.5a) 30 July 2015 [16:31] 30/07/2015 598871615299 598871615299
1 Offside rear brake recording little or no effort (3.7.b.5a) Offside rear brake recording little or no effort (3.7.b.5a) 30 July 2015 [16:31] 30/07/2015 598871615299 598871615299
1 Nearside stop lamp not working (1.2.1b) Nearside stop lamp not working (1.2.1b) 30 July 2015 [16:31] 30/07/2015 598871615299 598871615299
1 Offside stop lamp not working (1.2.1b) Offside stop lamp not working (1.2.1b) 30 July 2015 [16:31] 30/07/2015 598871615299 598871615299

ALL 664 UBB User Entered Faults [2]

ALL User Entered faults, ORDERED by OCCURRENCE DURING 664 UBB's MOT HISTORY
ALL 664 UBB User Entered Faults [2]
ALL User Entered faults, ORDERED by OCCURRENCE DURING 664 UBB's MOT HISTORY
Advisory Faults | source www.vehiclestats.co.uk
Fault Fault Test Date Test Date/Time Reference MOT Test Reference
2 Coolant leak Coolant leak 05 August 2015 [14:47] 05/08/2015 30 July 2015 [16:31] 30/07/2015 697847415227 697847415227 598871615299 598871615299

MOT TEST: 15 July 2016 14:57:58 PASSED
MOT TEST: 15 July 2016 14:57:58 PASSED

This test (907188451984) was completed on the 15 July 2016 14:57:58 and PASSED the requirements for a valid MOT with 1 comments.

This test (907188451984) was completed on the 15 July 2016 14:57:58 and PASSED the requirements for a valid MOT with 1 comments.

Recorded mileage: 51,030

Recorded mileage: 51,030


ADVISORY


MOT TEST: 05 August 2015 14:47:25 PASSED
MOT TEST: 05 August 2015 14:47:25 PASSED

This test (697847415227) was completed on the 05 August 2015 14:47:25 and PASSED the requirements for a valid MOT with 2 comments.

This test (697847415227) was completed on the 05 August 2015 14:47:25 and PASSED the requirements for a valid MOT with 2 comments.

Recorded mileage: 51,014

Recorded mileage: 51,014


ADVISORY

USER ENTERED


MOT TEST: 30 July 2015 16:31:01 FAILED
MOT TEST: 30 July 2015 16:31:01 FAILED

This test (598871615299) was completed on the 30 July 2015 16:31:01 and FAILED the requirements for a valid MOT with 10 comments.

This test (598871615299) was completed on the 30 July 2015 16:31:01 and FAILED the requirements for a valid MOT with 10 comments.

Recorded mileage: 51,014

Recorded mileage: 51,014


ADVISORY

FAIL

USER ENTERED


MOT TEST: 22 August 2013 16:45:32 PASSED
MOT TEST: 22 August 2013 16:45:32 PASSED

This test (407574533280) was completed on the 22 August 2013 16:45:32 and PASSED the requirements for a valid MOT with 1 comments.

This test (407574533280) was completed on the 22 August 2013 16:45:32 and PASSED the requirements for a valid MOT with 1 comments.

Recorded mileage: 51,010

Recorded mileage: 51,010


ADVISORY