665 3UZ


6653UZ is registered to a Blue 1968, Morris Minor with a Petrol engine. It Failed its most recent MOT Test on the 05 September 2016

7 unique faults (7 Total) reported in its MOT History (6 Tests).

0 common/recurring faults.

67% (4) MOT Pass Rate and a 33% (2) MOT Failure Rate.

66,144 recorded miles.

665 3UZ


6653UZ is registered to a Blue 1968, Morris Minor with a Petrol engine. It Failed its most recent MOT Test on the 05 September 2016

7 unique faults (7 Total) reported in its MOT History (6 Tests).

0 common/recurring faults.

67% (4) MOT Pass Rate and a 33% (2) MOT Failure Rate.

66,144 recorded miles.

MOT PASS/Failure rate for 665 3UZ

all MOT test results for 665 3UZ represented as a percentage
MOT PASS/Failure rate for 665 3UZ
all MOT test results for 665 3UZ represented as a percentage

PERCENTAGE OF VEHICLE FAULTS WITH 665 3UZ

ALL REPORTED FAULTS, DISPLAYED BY PERCENTAGE OF OCCURRENCE DURING ALL MOT TESTS
PERCENTAGE OF VEHICLE FAULTS WITH 665 3UZ
ALL REPORTED FAULTS, DISPLAYED BY PERCENTAGE OF OCCURRENCE DURING ALL MOT TESTS
FAIL

665 3UZ annual Faults by type

ALL REPORTED FAULTS, DISPLAYED over time and categorised by type
665 3UZ annual Faults by type
ALL REPORTED FAULTS, DISPLAYED over time and categorised by type

ALL 665 3UZ Failure Faults [7]

ALL Failure faults, ORDERED by OCCURRENCE DURING 665 3UZ's MOT HISTORY
ALL 665 3UZ Failure Faults [7]
ALL Failure faults, ORDERED by OCCURRENCE DURING 665 3UZ's MOT HISTORY
Fail Faults | source www.vehiclestats.co.uk
Fault Fault Test Date Test Date/Time Reference MOT Test Reference
1 Nearside track rod end ball joint has excessive play (2.2.b.1f) Nearside track rod end ball joint has excessive play (2.2.b.1f) 31 August 2016 [12:08] 31/08/2016 911236827326 911236827326
1 Offside windscreen washer provides insufficient washer liquid (8.2.3) Offside windscreen washer provides insufficient washer liquid (8.2.3) 31 August 2016 [12:08] 31/08/2016 911236827326 911236827326
1 Nearside front tyre(s) incorrect because different size tyres are fitted on the same axle. (4.1.a.1a) Nearside front tyre(s) incorrect because different size tyres are fitted on the same axle. (4.1.a.1a) 07 November 2006 [15:21] 07/11/2006 342841116343 342841116343
1 Offside rear suspension component mounting prescribed area is excessively corroded (2.4.a.3) Offside rear suspension component mounting prescribed area is excessively corroded (2.4.a.3) 07 November 2006 [15:21] 07/11/2006 342841116343 342841116343
1 Offside front direction indicator adversely affected by the operation of another lamp (1.4.a.2h) Offside front direction indicator adversely affected by the operation of another lamp (1.4.a.2h) 07 November 2006 [15:21] 07/11/2006 342841116343 342841116343
1 Nearside rear direction indicator incorrect colour (1.4.a.2f) Nearside rear direction indicator incorrect colour (1.4.a.2f) 07 November 2006 [15:21] 07/11/2006 342841116343 342841116343
1 Parking brake: efficiency below requirements (3.7.b.7) Parking brake: efficiency below requirements (3.7.b.7) 07 November 2006 [15:21] 07/11/2006 342841116343 342841116343

MOT TEST: 05 September 2016 11:13:46 PASSED
MOT TEST: 05 September 2016 11:13:46 PASSED

This test (505096175835) was completed on the 05 September 2016 11:13:46 and PASSED the requirements for a valid MOT with 0 comments.

This test (505096175835) was completed on the 05 September 2016 11:13:46 and PASSED the requirements for a valid MOT with 0 comments.

Recorded mileage: 66,144

Recorded mileage: 66,144


MOT TEST: 31 August 2016 12:08:06 FAILED
MOT TEST: 31 August 2016 12:08:06 FAILED

This test (911236827326) was completed on the 31 August 2016 12:08:06 and FAILED the requirements for a valid MOT with 2 comments.

This test (911236827326) was completed on the 31 August 2016 12:08:06 and FAILED the requirements for a valid MOT with 2 comments.

Recorded mileage: 66,144

Recorded mileage: 66,144


FAIL


MOT TEST: 28 July 2015 15:20:22 PASSED
MOT TEST: 28 July 2015 15:20:22 PASSED

This test (395499105216) was completed on the 28 July 2015 15:20:22 and PASSED the requirements for a valid MOT with 0 comments.

This test (395499105216) was completed on the 28 July 2015 15:20:22 and PASSED the requirements for a valid MOT with 0 comments.

Recorded mileage: 65,482

Recorded mileage: 65,482


MOT TEST: 26 November 2007 16:05:04 PASSED
MOT TEST: 26 November 2007 16:05:04 PASSED

This test (694420937394) was completed on the 26 November 2007 16:05:04 and PASSED the requirements for a valid MOT with 0 comments.

This test (694420937394) was completed on the 26 November 2007 16:05:04 and PASSED the requirements for a valid MOT with 0 comments.

Recorded mileage: 65,012

Recorded mileage: 65,012


MOT TEST: 08 November 2006 12:45:47 PASSED
MOT TEST: 08 November 2006 12:45:47 PASSED

This test (924562216302) was completed on the 08 November 2006 12:45:47 and PASSED the requirements for a valid MOT with 0 comments.

This test (924562216302) was completed on the 08 November 2006 12:45:47 and PASSED the requirements for a valid MOT with 0 comments.

Recorded mileage: 64,533

Recorded mileage: 64,533


MOT TEST: 07 November 2006 15:21:26 FAILED
MOT TEST: 07 November 2006 15:21:26 FAILED

This test (342841116343) was completed on the 07 November 2006 15:21:26 and FAILED the requirements for a valid MOT with 5 comments.

This test (342841116343) was completed on the 07 November 2006 15:21:26 and FAILED the requirements for a valid MOT with 5 comments.

Recorded mileage: 64,525

Recorded mileage: 64,525


FAIL