665 7DF


6657DF is registered to a Blue 1963, Morris Minor 1000 with a Petrol engine. It Passed its most recent MOT Test on the 13 November 2018

35 unique faults (49 Total) reported in its MOT History (24 Tests).

7 common/recurring faults, the most frequent (5 times) is: Parking brake: efficiency below requirements (3.7.B.7).

54% (13) MOT Pass Rate and a 46% (11) MOT Failure Rate.

46,848 recorded miles.

665 7DF


6657DF is registered to a Blue 1963, Morris Minor 1000 with a Petrol engine. It Passed its most recent MOT Test on the 13 November 2018

35 unique faults (49 Total) reported in its MOT History (24 Tests).

7 common/recurring faults, the most frequent (5 times) is: Parking brake: efficiency below requirements (3.7.B.7).

54% (13) MOT Pass Rate and a 46% (11) MOT Failure Rate.

46,848 recorded miles.

MOT PASS/Failure rate for 665 7DF

all MOT test results for 665 7DF represented as a percentage
MOT PASS/Failure rate for 665 7DF
all MOT test results for 665 7DF represented as a percentage

PERCENTAGE OF VEHICLE FAULTS WITH 665 7DF

ALL REPORTED FAULTS, DISPLAYED BY PERCENTAGE OF OCCURRENCE DURING ALL MOT TESTS
PERCENTAGE OF VEHICLE FAULTS WITH 665 7DF
ALL REPORTED FAULTS, DISPLAYED BY PERCENTAGE OF OCCURRENCE DURING ALL MOT TESTS
ADVISORY

FAIL

665 7DF annual Faults by type

ALL REPORTED FAULTS, DISPLAYED over time and categorised by type
665 7DF annual Faults by type
ALL REPORTED FAULTS, DISPLAYED over time and categorised by type

RECURRING FAULTS WITH 665 7DF

FAULTS THAT HAVE OCCURED MORE THAN ONCE DURING 665 7DF's MOT HISTORY
RECURRING FAULTS WITH 665 7DF
FAULTS THAT HAVE OCCURED MORE THAN ONCE DURING 665 7DF's MOT HISTORY
Fault Fault Test Date Test Date/Time Reference MOT Test Reference
5 Parking brake: efficiency below requirements (3.7.b.7) Parking brake: efficiency below requirements (3.7.b.7) 26 September 2017 [10:11] 26/09/2017 17 September 2012 [12:35] 17/09/2012 19 September 2011 [11:56] 19/09/2011 26 August 2009 [15:32] 26/08/2009 17 September 2007 [11:06] 17/09/2007 503988500866 503988500866 149141762285 149141762285 916302861233 916302861233 334588839416 334588839416 363890967281 363890967281
4 Steering column top bearing slightly worn (2.1.2c) Steering column top bearing slightly worn (2.1.2c) 17 September 2012 [17:01] 17/09/2012 17 September 2012 [12:35] 17/09/2012 28 August 2009 [10:07] 28/08/2009 26 August 2009 [15:32] 26/08/2009 266711162244 266711162244 149141762285 149141762285 901050849226 901050849226 334588839416 334588839416
4 Nearside front lower suspension arm has slight play in a pin/bush (2.4.g.2) Nearside front lower suspension arm has slight play in a pin/bush (2.4.g.2) 19 September 2011 [15:56] 19/09/2011 19 September 2011 [11:56] 19/09/2011 28 August 2009 [10:07] 28/08/2009 26 August 2009 [15:32] 26/08/2009 366092261269 366092261269 916302861233 916302861233 901050849226 901050849226 334588839416 334588839416
2 Rear wheel bearing has slight play both (2.6.2) Rear wheel bearing has slight play both (2.6.2) 26 September 2017 [13:43] 26/09/2017 26 September 2017 [10:11] 26/09/2017 521559974906 521559974906 503988500866 503988500866
2 Offside rear leaf spring has slight wear in a shackle pin and/or bush (2.4.b.2) Offside rear leaf spring has slight wear in a shackle pin and/or bush (2.4.b.2) 23 September 2013 [14:57] 23/09/2013 23 September 2013 [13:01] 23/09/2013 768256063221 768256063221 195776863222 195776863222
2 Steering column top bearing excessively worn (2.1.2c) Steering column top bearing excessively worn (2.1.2c) 23 September 2013 [13:01] 23/09/2013 28 September 2010 [15:05] 28/09/2010 195776863222 195776863222 910401770283 910401770283
2 Offside front upper suspension arm has slight play in a pin/bush (2.4.g.2) Offside front upper suspension arm has slight play in a pin/bush (2.4.g.2) 28 August 2009 [10:07] 28/08/2009 26 August 2009 [15:32] 26/08/2009 901050849226 901050849226 334588839416 334588839416

ALL 665 7DF ADVISORIES [17]

ALL ADVISORIES, ORDERED by OCCURRENCE DURING 665 7DF's MOT HISTORY
ALL 665 7DF ADVISORIES [17]
ALL ADVISORIES, ORDERED by OCCURRENCE DURING 665 7DF's MOT HISTORY
Advisory Faults | source www.vehiclestats.co.uk
Fault Fault Test Date Test Date/Time Reference MOT Test Reference
4 Steering column top bearing slightly worn (2.1.2c) Steering column top bearing slightly worn (2.1.2c) 17 September 2012 [17:01] 17/09/2012 17 September 2012 [12:35] 17/09/2012 28 August 2009 [10:07] 28/08/2009 26 August 2009 [15:32] 26/08/2009 266711162244 266711162244 149141762285 149141762285 901050849226 901050849226 334588839416 334588839416
4 Nearside front lower suspension arm has slight play in a pin/bush (2.4.g.2) Nearside front lower suspension arm has slight play in a pin/bush (2.4.g.2) 19 September 2011 [15:56] 19/09/2011 19 September 2011 [11:56] 19/09/2011 28 August 2009 [10:07] 28/08/2009 26 August 2009 [15:32] 26/08/2009 366092261269 366092261269 916302861233 916302861233 901050849226 901050849226 334588839416 334588839416
2 Rear wheel bearing has slight play both (2.6.2) Rear wheel bearing has slight play both (2.6.2) 26 September 2017 [13:43] 26/09/2017 26 September 2017 [10:11] 26/09/2017 521559974906 521559974906 503988500866 503988500866
2 Offside rear leaf spring has slight wear in a shackle pin and/or bush (2.4.b.2) Offside rear leaf spring has slight wear in a shackle pin and/or bush (2.4.b.2) 23 September 2013 [14:57] 23/09/2013 23 September 2013 [13:01] 23/09/2013 768256063221 768256063221 195776863222 195776863222
2 Offside front upper suspension arm has slight play in a pin/bush (2.4.g.2) Offside front upper suspension arm has slight play in a pin/bush (2.4.g.2) 28 August 2009 [10:07] 28/08/2009 26 August 2009 [15:32] 26/08/2009 901050849226 901050849226 334588839416 334588839416
1 Offside front wheel bearing has slight play (5.1.3 (a) (i)) Offside front wheel bearing has slight play (5.1.3 (a) (i)) 13 November 2018 [12:14] 13/11/2018 983120012442 983120012442
1 Nearside front wheel bearing has slight play (2.5.a.3c) Nearside front wheel bearing has slight play (2.5.a.3c) 26 September 2017 [10:11] 26/09/2017 503988500866 503988500866
1 Nearside front lower front suspension has slight play in a lower suspension ball joint (2.5.b.1a) Nearside front lower front suspension has slight play in a lower suspension ball joint (2.5.b.1a) 19 September 2016 [14:06] 19/09/2016 221795530822 221795530822

ALL 665 7DF Failure Faults [32]

ALL Failure faults, ORDERED by OCCURRENCE DURING 665 7DF's MOT HISTORY
ALL 665 7DF Failure Faults [32]
ALL Failure faults, ORDERED by OCCURRENCE DURING 665 7DF's MOT HISTORY
Advisory Faults | source www.vehiclestats.co.uk
Fault Fault Test Date Test Date/Time Reference MOT Test Reference
5 Parking brake: efficiency below requirements (3.7.b.7) Parking brake: efficiency below requirements (3.7.b.7) 26 September 2017 [10:11] 26/09/2017 17 September 2012 [12:35] 17/09/2012 19 September 2011 [11:56] 19/09/2011 26 August 2009 [15:32] 26/08/2009 17 September 2007 [11:06] 17/09/2007 503988500866 503988500866 149141762285 149141762285 916302861233 916302861233 334588839416 334588839416 363890967281 363890967281
2 Steering column top bearing excessively worn (2.1.2c) Steering column top bearing excessively worn (2.1.2c) 23 September 2013 [13:01] 23/09/2013 28 September 2010 [15:05] 28/09/2010 195776863222 195776863222 910401770283 910401770283
1 Front windscreen wiper does not clear the windscreen effectively (3.4 (b) (ii)) Front windscreen wiper does not clear the windscreen effectively (3.4 (b) (ii)) 13 November 2018 [12:14] 13/11/2018 983120012442 983120012442
1 Registration plate lamp inoperative in the case of a single lamp or all lamps (4.7.1 (b) (ii)) Registration plate lamp inoperative in the case of a single lamp or all lamps (4.7.1 (b) (ii)) 13 November 2018 [12:14] 13/11/2018 983120012442 983120012442
1 Offside rear suspension component mounting prescribed area excessively corroded significantly reducing structural strength inner wheel arch (5.3.6 (a) (i)) Offside rear suspension component mounting prescribed area excessively corroded significantly reducing structural strength inner wheel arch (5.3.6 (a) (i)) 13 November 2018 [12:14] 13/11/2018 983120012442 983120012442
1 Rear parking brake recording little or no effort (3.7.b.6a) Rear parking brake recording little or no effort (3.7.b.6a) 26 September 2017 [10:11] 26/09/2017 503988500866 503988500866
1 Centre rear brake hose excessively deteriorated (3.6.b.4d) Centre rear brake hose excessively deteriorated (3.6.b.4d) 21 September 2015 [13:13] 21/09/2015 697984004681 697984004681
1 Offside rear leaf spring has excessive wear in a shackle pin and/or bush (2.4.b.2) Offside rear leaf spring has excessive wear in a shackle pin and/or bush (2.4.b.2) 22 September 2014 [12:34] 22/09/2014 565515664267 565515664267
1 Windscreen washer provides insufficient washer liquid (8.2.3) Windscreen washer provides insufficient washer liquid (8.2.3) 23 September 2013 [13:01] 23/09/2013 195776863222 195776863222
1 Nearside stop lamp not working (1.2.1b) Nearside stop lamp not working (1.2.1b) 23 September 2013 [13:01] 23/09/2013 195776863222 195776863222
1 Offside stop lamp not working (1.2.1b) Offside stop lamp not working (1.2.1b) 23 September 2013 [13:01] 23/09/2013 195776863222 195776863222
1 Offside track rod end ball joint dust cover insecure so that it no longer prevents the ingress of dirt (2.2.c.1c) Offside track rod end ball joint dust cover insecure so that it no longer prevents the ingress of dirt (2.2.c.1c) 17 September 2012 [12:35] 17/09/2012 149141762285 149141762285
1 Nearside headlamp aim too low (1.8) Nearside headlamp aim too low (1.8) 19 September 2011 [11:56] 19/09/2011 916302861233 916302861233
1 Nearside front anti-roll bar attachment bracket/mounting insecure (2.4.g.1) Nearside front anti-roll bar attachment bracket/mounting insecure (2.4.g.1) 19 September 2011 [11:56] 19/09/2011 916302861233 916302861233
1 Offside front anti-roll bar attachment bracket/mounting insecure (2.4.g.1) Offside front anti-roll bar attachment bracket/mounting insecure (2.4.g.1) 19 September 2011 [11:56] 19/09/2011 916302861233 916302861233
1 Nearside rear parking brake recording little or no effort (3.7.b.6a) Nearside rear parking brake recording little or no effort (3.7.b.6a) 19 September 2011 [11:56] 19/09/2011 916302861233 916302861233
1 Steering column shaft has excessive end float (2.1.3) Steering column shaft has excessive end float (2.1.3) 28 September 2010 [15:05] 28/09/2010 910401770283 910401770283
1 Nearside front shock absorber has an excessively worn shock absorber pivot (2.7.4) Nearside front shock absorber has an excessively worn shock absorber pivot (2.7.4) 28 September 2010 [15:05] 28/09/2010 910401770283 910401770283
1 Nearside front upper suspension arm has excessive play in a pin/bush (2.4.g.2) Nearside front upper suspension arm has excessive play in a pin/bush (2.4.g.2) 28 September 2010 [15:05] 28/09/2010 910401770283 910401770283
1 Nearside rear leaf spring has excessive wear in a shackle pin and/or bush (2.4.b.2) Nearside rear leaf spring has excessive wear in a shackle pin and/or bush (2.4.b.2) 28 September 2010 [15:05] 28/09/2010 910401770283 910401770283
1 Rear brake application uneven (3.7.b.2) Rear brake application uneven (3.7.b.2) 28 September 2010 [15:05] 28/09/2010 910401770283 910401770283
1 Nearside front suspension component mounting prescribed area is excessively corroded (2.4.a.3) Nearside front suspension component mounting prescribed area is excessively corroded (2.4.a.3) 26 August 2009 [15:32] 26/08/2009 334588839416 334588839416
1 Offside front suspension component mounting prescribed area is excessively corroded (2.4.a.3) Offside front suspension component mounting prescribed area is excessively corroded (2.4.a.3) 26 August 2009 [15:32] 26/08/2009 334588839416 334588839416
1 Offside rear parking brake recording little or no effort (3.7.b.6a) Offside rear parking brake recording little or no effort (3.7.b.6a) 26 August 2009 [15:32] 26/08/2009 334588839416 334588839416
1 Rear rear passenger seat cannot be secured in the upright position. (6.2.3) Rear rear passenger seat cannot be secured in the upright position. (6.2.3) 16 September 2008 [14:16] 16/09/2008 210400368280 210400368280
1 Nearside rear stop lamp adversely affected by the operation of another lamp (1.2.1f) Nearside rear stop lamp adversely affected by the operation of another lamp (1.2.1f) 16 September 2008 [14:16] 16/09/2008 210400368280 210400368280
1 Offside rear stop lamp not working (1.2.1b) Offside rear stop lamp not working (1.2.1b) 16 September 2008 [14:16] 16/09/2008 210400368280 210400368280

MOT TEST: 13 November 2018 16:09:09 PASSED
MOT TEST: 13 November 2018 16:09:09 PASSED

This test (945204733090) was completed on the 13 November 2018 16:09:09 and PASSED the requirements for a valid MOT with 0 comments.

This test (945204733090) was completed on the 13 November 2018 16:09:09 and PASSED the requirements for a valid MOT with 0 comments.

Recorded mileage: 1,009

Recorded mileage: 1,009


MOT TEST: 13 November 2018 12:14:32 FAILED
MOT TEST: 13 November 2018 12:14:32 FAILED

This test (983120012442) was completed on the 13 November 2018 12:14:32 and FAILED the requirements for a valid MOT with 4 comments.

This test (983120012442) was completed on the 13 November 2018 12:14:32 and FAILED the requirements for a valid MOT with 4 comments.

Recorded mileage: 1,007

Recorded mileage: 1,007


ADVISORY

FAIL


MOT TEST: 26 September 2017 13:43:07 PASSED
MOT TEST: 26 September 2017 13:43:07 PASSED

This test (521559974906) was completed on the 26 September 2017 13:43:07 and PASSED the requirements for a valid MOT with 1 comments.

This test (521559974906) was completed on the 26 September 2017 13:43:07 and PASSED the requirements for a valid MOT with 1 comments.

Recorded mileage: 7

Recorded mileage: 7


ADVISORY


MOT TEST: 26 September 2017 10:11:42 FAILED
MOT TEST: 26 September 2017 10:11:42 FAILED

This test (503988500866) was completed on the 26 September 2017 10:11:42 and FAILED the requirements for a valid MOT with 4 comments.

This test (503988500866) was completed on the 26 September 2017 10:11:42 and FAILED the requirements for a valid MOT with 4 comments.

Recorded mileage: 46,848

Recorded mileage: 46,848


ADVISORY

FAIL


MOT TEST: 19 September 2016 14:06:07 PASSED
MOT TEST: 19 September 2016 14:06:07 PASSED

This test (221795530822) was completed on the 19 September 2016 14:06:07 and PASSED the requirements for a valid MOT with 1 comments.

This test (221795530822) was completed on the 19 September 2016 14:06:07 and PASSED the requirements for a valid MOT with 1 comments.

Recorded mileage: 45,637

Recorded mileage: 45,637


ADVISORY


MOT TEST: 21 September 2015 14:54:39 PASSED
MOT TEST: 21 September 2015 14:54:39 PASSED

This test (898258584458) was completed on the 21 September 2015 14:54:39 and PASSED the requirements for a valid MOT with 0 comments.

This test (898258584458) was completed on the 21 September 2015 14:54:39 and PASSED the requirements for a valid MOT with 0 comments.

Recorded mileage: 44,555

Recorded mileage: 44,555


MOT TEST: 21 September 2015 13:13:51 FAILED
MOT TEST: 21 September 2015 13:13:51 FAILED

This test (697984004681) was completed on the 21 September 2015 13:13:51 and FAILED the requirements for a valid MOT with 1 comments.

This test (697984004681) was completed on the 21 September 2015 13:13:51 and FAILED the requirements for a valid MOT with 1 comments.

Recorded mileage: 44,555

Recorded mileage: 44,555


FAIL


MOT TEST: 22 September 2014 17:01:48 PASSED
MOT TEST: 22 September 2014 17:01:48 PASSED

This test (129365064260) was completed on the 22 September 2014 17:01:48 and PASSED the requirements for a valid MOT with 0 comments.

This test (129365064260) was completed on the 22 September 2014 17:01:48 and PASSED the requirements for a valid MOT with 0 comments.

Recorded mileage: 39,707

Recorded mileage: 39,707


MOT TEST: 22 September 2014 12:34:45 FAILED
MOT TEST: 22 September 2014 12:34:45 FAILED

This test (565515664267) was completed on the 22 September 2014 12:34:45 and FAILED the requirements for a valid MOT with 1 comments.

This test (565515664267) was completed on the 22 September 2014 12:34:45 and FAILED the requirements for a valid MOT with 1 comments.

Recorded mileage: 39,706

Recorded mileage: 39,706


FAIL


MOT TEST: 23 September 2013 14:57:07 PASSED
MOT TEST: 23 September 2013 14:57:07 PASSED

This test (768256063221) was completed on the 23 September 2013 14:57:07 and PASSED the requirements for a valid MOT with 1 comments.

This test (768256063221) was completed on the 23 September 2013 14:57:07 and PASSED the requirements for a valid MOT with 1 comments.

Recorded mileage: 38,342

Recorded mileage: 38,342


ADVISORY


MOT TEST: 23 September 2013 13:01:53 FAILED
MOT TEST: 23 September 2013 13:01:53 FAILED

This test (195776863222) was completed on the 23 September 2013 13:01:53 and FAILED the requirements for a valid MOT with 5 comments.

This test (195776863222) was completed on the 23 September 2013 13:01:53 and FAILED the requirements for a valid MOT with 5 comments.

Recorded mileage: 38,342

Recorded mileage: 38,342


ADVISORY

FAIL


MOT TEST: 17 September 2012 17:01:03 PASSED
MOT TEST: 17 September 2012 17:01:03 PASSED

This test (266711162244) was completed on the 17 September 2012 17:01:03 and PASSED the requirements for a valid MOT with 1 comments.

This test (266711162244) was completed on the 17 September 2012 17:01:03 and PASSED the requirements for a valid MOT with 1 comments.

Recorded mileage: 35,580

Recorded mileage: 35,580


ADVISORY


MOT TEST: 17 September 2012 12:35:02 FAILED
MOT TEST: 17 September 2012 12:35:02 FAILED

This test (149141762285) was completed on the 17 September 2012 12:35:02 and FAILED the requirements for a valid MOT with 3 comments.

This test (149141762285) was completed on the 17 September 2012 12:35:02 and FAILED the requirements for a valid MOT with 3 comments.

Recorded mileage: 35,579

Recorded mileage: 35,579


ADVISORY

FAIL


MOT TEST: 19 September 2011 15:56:39 PASSED
MOT TEST: 19 September 2011 15:56:39 PASSED

This test (366092261269) was completed on the 19 September 2011 15:56:39 and PASSED the requirements for a valid MOT with 1 comments.

This test (366092261269) was completed on the 19 September 2011 15:56:39 and PASSED the requirements for a valid MOT with 1 comments.

Recorded mileage: 29,437

Recorded mileage: 29,437


ADVISORY


MOT TEST: 19 September 2011 11:56:15 FAILED
MOT TEST: 19 September 2011 11:56:15 FAILED

This test (916302861233) was completed on the 19 September 2011 11:56:15 and FAILED the requirements for a valid MOT with 6 comments.

This test (916302861233) was completed on the 19 September 2011 11:56:15 and FAILED the requirements for a valid MOT with 6 comments.

Recorded mileage: 29,435

Recorded mileage: 29,435


ADVISORY

FAIL


MOT TEST: 29 September 2010 13:06:44 PASSED
MOT TEST: 29 September 2010 13:06:44 PASSED

This test (394982570243) was completed on the 29 September 2010 13:06:44 and PASSED the requirements for a valid MOT with 0 comments.

This test (394982570243) was completed on the 29 September 2010 13:06:44 and PASSED the requirements for a valid MOT with 0 comments.

Recorded mileage: 26,706

Recorded mileage: 26,706


MOT TEST: 28 September 2010 15:05:02 FAILED
MOT TEST: 28 September 2010 15:05:02 FAILED

This test (910401770283) was completed on the 28 September 2010 15:05:02 and FAILED the requirements for a valid MOT with 6 comments.

This test (910401770283) was completed on the 28 September 2010 15:05:02 and FAILED the requirements for a valid MOT with 6 comments.

Recorded mileage: 26,705

Recorded mileage: 26,705


FAIL


MOT TEST: 28 August 2009 10:07:34 PASSED
MOT TEST: 28 August 2009 10:07:34 PASSED

This test (901050849226) was completed on the 28 August 2009 10:07:34 and PASSED the requirements for a valid MOT with 3 comments.

This test (901050849226) was completed on the 28 August 2009 10:07:34 and PASSED the requirements for a valid MOT with 3 comments.

Recorded mileage: 21,489

Recorded mileage: 21,489


ADVISORY


MOT TEST: 26 August 2009 15:32:33 FAILED
MOT TEST: 26 August 2009 15:32:33 FAILED

This test (334588839416) was completed on the 26 August 2009 15:32:33 and FAILED the requirements for a valid MOT with 7 comments.

This test (334588839416) was completed on the 26 August 2009 15:32:33 and FAILED the requirements for a valid MOT with 7 comments.

Recorded mileage: 21,487

Recorded mileage: 21,487


ADVISORY

FAIL


MOT TEST: 22 September 2008 11:33:51 PASSED
MOT TEST: 22 September 2008 11:33:51 PASSED

This test (690346068211) was completed on the 22 September 2008 11:33:51 and PASSED the requirements for a valid MOT with 0 comments.

This test (690346068211) was completed on the 22 September 2008 11:33:51 and PASSED the requirements for a valid MOT with 0 comments.

Recorded mileage: 16,020

Recorded mileage: 16,020


MOT TEST: 16 September 2008 14:16:59 FAILED
MOT TEST: 16 September 2008 14:16:59 FAILED

This test (210400368280) was completed on the 16 September 2008 14:16:59 and FAILED the requirements for a valid MOT with 3 comments.

This test (210400368280) was completed on the 16 September 2008 14:16:59 and FAILED the requirements for a valid MOT with 3 comments.

Recorded mileage: 16,020

Recorded mileage: 16,020


FAIL


MOT TEST: 18 September 2007 08:57:22 PASSED
MOT TEST: 18 September 2007 08:57:22 PASSED

This test (932161267261) was completed on the 18 September 2007 08:57:22 and PASSED the requirements for a valid MOT with 0 comments.

This test (932161267261) was completed on the 18 September 2007 08:57:22 and PASSED the requirements for a valid MOT with 0 comments.

Recorded mileage: 11,477

Recorded mileage: 11,477


MOT TEST: 17 September 2007 11:06:46 FAILED
MOT TEST: 17 September 2007 11:06:46 FAILED

This test (363890967281) was completed on the 17 September 2007 11:06:46 and FAILED the requirements for a valid MOT with 1 comments.

This test (363890967281) was completed on the 17 September 2007 11:06:46 and FAILED the requirements for a valid MOT with 1 comments.

Recorded mileage: 11,467

Recorded mileage: 11,467


FAIL


MOT TEST: 11 September 2006 11:38:57 PASSED
MOT TEST: 11 September 2006 11:38:57 PASSED

This test (864444556202) was completed on the 11 September 2006 11:38:57 and PASSED the requirements for a valid MOT with 0 comments.

This test (864444556202) was completed on the 11 September 2006 11:38:57 and PASSED the requirements for a valid MOT with 0 comments.

Recorded mileage: 5,292

Recorded mileage: 5,292