670 HTA


670HTA is registered to a Grey 1961, Morris Minor 1000 with a Petrol engine. It Failed its most recent MOT Test on the 18 May 2017

18 unique faults (21 Total) reported in its MOT History (16 Tests).

2 common/recurring faults, the most frequent (2 times) is: Offside jacking point / floor pan corroded.

81% (13) MOT Pass Rate and a 19% (3) MOT Failure Rate.

97,652 recorded miles.

670 HTA


670HTA is registered to a Grey 1961, Morris Minor 1000 with a Petrol engine. It Failed its most recent MOT Test on the 18 May 2017

18 unique faults (21 Total) reported in its MOT History (16 Tests).

2 common/recurring faults, the most frequent (2 times) is: Offside jacking point / floor pan corroded.

81% (13) MOT Pass Rate and a 19% (3) MOT Failure Rate.

97,652 recorded miles.

MOT PASS/Failure rate for 670 HTA

all MOT test results for 670 HTA represented as a percentage
MOT PASS/Failure rate for 670 HTA
all MOT test results for 670 HTA represented as a percentage

PERCENTAGE OF VEHICLE FAULTS WITH 670 HTA

ALL REPORTED FAULTS, DISPLAYED BY PERCENTAGE OF OCCURRENCE DURING ALL MOT TESTS
PERCENTAGE OF VEHICLE FAULTS WITH 670 HTA
ALL REPORTED FAULTS, DISPLAYED BY PERCENTAGE OF OCCURRENCE DURING ALL MOT TESTS
ADVISORY

FAIL

USER ENTERED

670 HTA annual Faults by type

ALL REPORTED FAULTS, DISPLAYED over time and categorised by type
670 HTA annual Faults by type
ALL REPORTED FAULTS, DISPLAYED over time and categorised by type

RECURRING FAULTS WITH 670 HTA

FAULTS THAT HAVE OCCURED MORE THAN ONCE DURING 670 HTA's MOT HISTORY
RECURRING FAULTS WITH 670 HTA
FAULTS THAT HAVE OCCURED MORE THAN ONCE DURING 670 HTA's MOT HISTORY
Fault Fault Test Date Test Date/Time Reference MOT Test Reference
2 Offside jacking point / floor pan corroded Offside jacking point / floor pan corroded 18 May 2017 [11:19] 18/05/2017 17 May 2017 [10:13] 17/05/2017 218618940926 218618940926 387900146075 387900146075
2 Offside front lower suspension arm has slight play in a pin/bush (2.4.g.2) Offside front lower suspension arm has slight play in a pin/bush (2.4.g.2) 11 June 2008 [10:17] 11/06/2008 10 June 2008 [16:24] 10/06/2008 870043468132 870043468132 222322668452 222322668452

ALL 670 HTA ADVISORIES [9]

ALL ADVISORIES, ORDERED by OCCURRENCE DURING 670 HTA's MOT HISTORY
ALL 670 HTA ADVISORIES [9]
ALL ADVISORIES, ORDERED by OCCURRENCE DURING 670 HTA's MOT HISTORY
Advisory Faults | source www.vehiclestats.co.uk
Fault Fault Test Date Test Date/Time Reference MOT Test Reference
2 Offside jacking point / floor pan corroded Offside jacking point / floor pan corroded 18 May 2017 [11:19] 18/05/2017 17 May 2017 [10:13] 17/05/2017 218618940926 218618940926 387900146075 387900146075
2 Offside front lower suspension arm has slight play in a pin/bush (2.4.g.2) Offside front lower suspension arm has slight play in a pin/bush (2.4.g.2) 11 June 2008 [10:17] 11/06/2008 10 June 2008 [16:24] 10/06/2008 870043468132 870043468132 222322668452 222322668452
1 Front brakes imbalanced requirements only just met. It would appear that the braking system requires adjustment or repair. (3.7.b.5b) Front brakes imbalanced requirements only just met. It would appear that the braking system requires adjustment or repair. (3.7.b.5b) 02 June 2016 [14:00] 02/06/2016 384476132721 384476132721
1 Nearside track rod end ball joint dust cover deteriorated, but preventing the ingress of dirt (2.2.c.1c) Nearside track rod end ball joint dust cover deteriorated, but preventing the ingress of dirt (2.2.c.1c) 02 June 2016 [14:00] 02/06/2016 384476132721 384476132721
1 Offside track rod end ball joint dust cover deteriorated, but preventing the ingress of dirt (2.2.c.1c) Offside track rod end ball joint dust cover deteriorated, but preventing the ingress of dirt (2.2.c.1c) 02 June 2016 [14:00] 02/06/2016 384476132721 384476132721
1 Offside jacking point corroded Offside jacking point corroded 02 June 2016 [14:00] 02/06/2016 384476132721 384476132721
1 Offside front suspension component mounting prescribed area is corroded but not considered excessive (2.4.a.3) Offside front suspension component mounting prescribed area is corroded but not considered excessive (2.4.a.3) 10 June 2015 [15:43] 10/06/2015 219251365152 219251365152

ALL 670 HTA Failure Faults [11]

ALL Failure faults, ORDERED by OCCURRENCE DURING 670 HTA's MOT HISTORY
ALL 670 HTA Failure Faults [11]
ALL Failure faults, ORDERED by OCCURRENCE DURING 670 HTA's MOT HISTORY
Fail Faults | source www.vehiclestats.co.uk
Fault Fault Test Date Test Date/Time Reference MOT Test Reference
1 Offside windscreen washer provides insufficient washer liquid (8.2.3) Offside windscreen washer provides insufficient washer liquid (8.2.3) 17 May 2017 [10:13] 17/05/2017 387900146075 387900146075
1 Brake pedal anti-slip provision missing (3.3.a.1b) Brake pedal anti-slip provision missing (3.3.a.1b) 17 May 2017 [10:13] 17/05/2017 387900146075 387900146075
1 Offside rear shock absorber insecure loose on mounting (2.7.2b) Offside rear shock absorber insecure loose on mounting (2.7.2b) 17 May 2017 [10:13] 17/05/2017 387900146075 387900146075
1 Nearside track rod end ball joint dust cover excessively deteriorated so that it no longer prevents the ingress of dirt (2.2.c.1c) Nearside track rod end ball joint dust cover excessively deteriorated so that it no longer prevents the ingress of dirt (2.2.c.1c) 17 May 2017 [10:13] 17/05/2017 387900146075 387900146075
1 Offside track rod end ball joint dust cover excessively deteriorated so that it no longer prevents the ingress of dirt (2.2.c.1c) Offside track rod end ball joint dust cover excessively deteriorated so that it no longer prevents the ingress of dirt (2.2.c.1c) 17 May 2017 [10:13] 17/05/2017 387900146075 387900146075
1 Nearside front suspension component mounting prescribed area is excessively corroded (2.4.a.3) Nearside front suspension component mounting prescribed area is excessively corroded (2.4.a.3) 10 June 2008 [16:24] 10/06/2008 222322668452 222322668452
1 Nearside suspension spring mounting prescribed area is excessively corroded (2.4.a.3) Nearside suspension spring mounting prescribed area is excessively corroded (2.4.a.3) 10 June 2008 [16:24] 10/06/2008 222322668452 222322668452
1 Offside front brake pipe excessively corroded (3.6.b.2c) Offside front brake pipe excessively corroded (3.6.b.2c) 10 June 2008 [16:24] 10/06/2008 222322668452 222322668452
1 Offside suspension spring mounting prescribed area is excessively corroded (2.4.a.3) Offside suspension spring mounting prescribed area is excessively corroded (2.4.a.3) 30 June 2007 [09:48] 30/06/2007 201501687473 201501687473
1 Nearside registration plate lamp not working (1.1.c.1d) Nearside registration plate lamp not working (1.1.c.1d) 30 June 2007 [09:48] 30/06/2007 201501687473 201501687473

ALL 670 HTA User Entered Faults [1]

ALL User Entered faults, ORDERED by OCCURRENCE DURING 670 HTA's MOT HISTORY
ALL 670 HTA User Entered Faults [1]
ALL User Entered faults, ORDERED by OCCURRENCE DURING 670 HTA's MOT HISTORY
User Entered Faults | source www.vehiclestats.co.uk
Fault Fault Test Date Test Date/Time Reference MOT Test Reference
1 Nearside front floor area/inner body sill area slightly corroded but not within any prescribed area Nearside front floor area/inner body sill area slightly corroded but not within any prescribed area 21 June 2010 [09:39] 21/06/2010 731292070168 731292070168

MOT TEST: 18 May 2017 11:19:15 PASSED
MOT TEST: 18 May 2017 11:19:15 PASSED

This test (218618940926) was completed on the 18 May 2017 11:19:15 and PASSED the requirements for a valid MOT with 1 comments.

This test (218618940926) was completed on the 18 May 2017 11:19:15 and PASSED the requirements for a valid MOT with 1 comments.

Recorded mileage: 97,652

Recorded mileage: 97,652


ADVISORY


MOT TEST: 17 May 2017 10:13:37 FAILED
MOT TEST: 17 May 2017 10:13:37 FAILED

This test (387900146075) was completed on the 17 May 2017 10:13:37 and FAILED the requirements for a valid MOT with 6 comments.

This test (387900146075) was completed on the 17 May 2017 10:13:37 and FAILED the requirements for a valid MOT with 6 comments.

Recorded mileage: 97,652

Recorded mileage: 97,652


ADVISORY

FAIL


MOT TEST: 02 June 2016 14:00:37 PASSED
MOT TEST: 02 June 2016 14:00:37 PASSED

This test (384476132721) was completed on the 02 June 2016 14:00:37 and PASSED the requirements for a valid MOT with 4 comments.

This test (384476132721) was completed on the 02 June 2016 14:00:37 and PASSED the requirements for a valid MOT with 4 comments.

Recorded mileage: 96,956

Recorded mileage: 96,956


ADVISORY


MOT TEST: 10 June 2015 15:43:47 PASSED
MOT TEST: 10 June 2015 15:43:47 PASSED

This test (219251365152) was completed on the 10 June 2015 15:43:47 and PASSED the requirements for a valid MOT with 1 comments.

This test (219251365152) was completed on the 10 June 2015 15:43:47 and PASSED the requirements for a valid MOT with 1 comments.

Recorded mileage: 96,912

Recorded mileage: 96,912


ADVISORY


MOT TEST: 16 April 2014 18:29:11 PASSED
MOT TEST: 16 April 2014 18:29:11 PASSED

This test (625266504181) was completed on the 16 April 2014 18:29:11 and PASSED the requirements for a valid MOT with 0 comments.

This test (625266504181) was completed on the 16 April 2014 18:29:11 and PASSED the requirements for a valid MOT with 0 comments.

Recorded mileage: 96,325

Recorded mileage: 96,325


MOT TEST: 10 April 2013 12:52:25 PASSED
MOT TEST: 10 April 2013 12:52:25 PASSED

This test (408450603185) was completed on the 10 April 2013 12:52:25 and PASSED the requirements for a valid MOT with 0 comments.

This test (408450603185) was completed on the 10 April 2013 12:52:25 and PASSED the requirements for a valid MOT with 0 comments.

Recorded mileage: 95,580

Recorded mileage: 95,580


MOT TEST: 24 April 2012 11:48:12 PASSED
MOT TEST: 24 April 2012 11:48:12 PASSED

This test (746815212165) was completed on the 24 April 2012 11:48:12 and PASSED the requirements for a valid MOT with 0 comments.

This test (746815212165) was completed on the 24 April 2012 11:48:12 and PASSED the requirements for a valid MOT with 0 comments.

Recorded mileage: 94,684

Recorded mileage: 94,684


MOT TEST: 09 May 2011 15:41:45 PASSED
MOT TEST: 09 May 2011 15:41:45 PASSED

This test (208289221479) was completed on the 09 May 2011 15:41:45 and PASSED the requirements for a valid MOT with 0 comments.

This test (208289221479) was completed on the 09 May 2011 15:41:45 and PASSED the requirements for a valid MOT with 0 comments.

Recorded mileage: 94,366

Recorded mileage: 94,366


MOT TEST: 21 June 2010 09:39:59 PASSED
MOT TEST: 21 June 2010 09:39:59 PASSED

This test (731292070168) was completed on the 21 June 2010 09:39:59 and PASSED the requirements for a valid MOT with 1 comments.

This test (731292070168) was completed on the 21 June 2010 09:39:59 and PASSED the requirements for a valid MOT with 1 comments.

Recorded mileage: 93,267

Recorded mileage: 93,267


USER ENTERED


MOT TEST: 25 June 2009 16:57:46 PASSED
MOT TEST: 25 June 2009 16:57:46 PASSED

This test (143846379188) was completed on the 25 June 2009 16:57:46 and PASSED the requirements for a valid MOT with 0 comments.

This test (143846379188) was completed on the 25 June 2009 16:57:46 and PASSED the requirements for a valid MOT with 0 comments.

Recorded mileage: 92,175

Recorded mileage: 92,175


MOT TEST: 11 June 2008 10:17:31 PASSED
MOT TEST: 11 June 2008 10:17:31 PASSED

This test (870043468132) was completed on the 11 June 2008 10:17:31 and PASSED the requirements for a valid MOT with 1 comments.

This test (870043468132) was completed on the 11 June 2008 10:17:31 and PASSED the requirements for a valid MOT with 1 comments.

Recorded mileage: 91,435

Recorded mileage: 91,435


ADVISORY


MOT TEST: 10 June 2008 16:24:12 FAILED
MOT TEST: 10 June 2008 16:24:12 FAILED

This test (222322668452) was completed on the 10 June 2008 16:24:12 and FAILED the requirements for a valid MOT with 4 comments.

This test (222322668452) was completed on the 10 June 2008 16:24:12 and FAILED the requirements for a valid MOT with 4 comments.

Recorded mileage: 91,435

Recorded mileage: 91,435


ADVISORY

FAIL


MOT TEST: 04 July 2007 12:42:32 PASSED
MOT TEST: 04 July 2007 12:42:32 PASSED

This test (792825887138) was completed on the 04 July 2007 12:42:32 and PASSED the requirements for a valid MOT with 0 comments.

This test (792825887138) was completed on the 04 July 2007 12:42:32 and PASSED the requirements for a valid MOT with 0 comments.

Recorded mileage: 91,124

Recorded mileage: 91,124


MOT TEST: 30 June 2007 09:48:18 FAILED
MOT TEST: 30 June 2007 09:48:18 FAILED

This test (201501687473) was completed on the 30 June 2007 09:48:18 and FAILED the requirements for a valid MOT with 3 comments.

This test (201501687473) was completed on the 30 June 2007 09:48:18 and FAILED the requirements for a valid MOT with 3 comments.

Recorded mileage: 91,086

Recorded mileage: 91,086


FAIL


MOT TEST: 01 July 2006 09:26:51 PASSED
MOT TEST: 01 July 2006 09:26:51 PASSED

This test (241862486124) was completed on the 01 July 2006 09:26:51 and PASSED the requirements for a valid MOT with 0 comments.

This test (241862486124) was completed on the 01 July 2006 09:26:51 and PASSED the requirements for a valid MOT with 0 comments.

Recorded mileage: 89,534

Recorded mileage: 89,534


MOT TEST: 21 June 2005 09:02:27 PASSED
MOT TEST: 21 June 2005 09:02:27 PASSED

This test (480352475130) was completed on the 21 June 2005 09:02:27 and PASSED the requirements for a valid MOT with 0 comments.

This test (480352475130) was completed on the 21 June 2005 09:02:27 and PASSED the requirements for a valid MOT with 0 comments.

Recorded mileage: 88,418

Recorded mileage: 88,418