673 8AD


6738AD is registered to a Purple 1961, Morris Minor 1000 with a Petrol engine. It Passed its most recent MOT Test on the 10 May 2018

21 unique faults (22 Total) reported in its MOT History (16 Tests).

1 common/recurring faults.

75% (12) MOT Pass Rate and a 25% (4) MOT Failure Rate.

19,505 recorded miles.

673 8AD


6738AD is registered to a Purple 1961, Morris Minor 1000 with a Petrol engine. It Passed its most recent MOT Test on the 10 May 2018

21 unique faults (22 Total) reported in its MOT History (16 Tests).

1 common/recurring faults.

75% (12) MOT Pass Rate and a 25% (4) MOT Failure Rate.

19,505 recorded miles.

MOT PASS/Failure rate for 673 8AD

all MOT test results for 673 8AD represented as a percentage
MOT PASS/Failure rate for 673 8AD
all MOT test results for 673 8AD represented as a percentage

PERCENTAGE OF VEHICLE FAULTS WITH 673 8AD

ALL REPORTED FAULTS, DISPLAYED BY PERCENTAGE OF OCCURRENCE DURING ALL MOT TESTS
PERCENTAGE OF VEHICLE FAULTS WITH 673 8AD
ALL REPORTED FAULTS, DISPLAYED BY PERCENTAGE OF OCCURRENCE DURING ALL MOT TESTS
ADVISORY

FAIL

USER ENTERED

673 8AD annual Faults by type

ALL REPORTED FAULTS, DISPLAYED over time and categorised by type
673 8AD annual Faults by type
ALL REPORTED FAULTS, DISPLAYED over time and categorised by type

ALL 673 8AD ADVISORIES [6]

ALL ADVISORIES, ORDERED by OCCURRENCE DURING 673 8AD's MOT HISTORY
ALL 673 8AD ADVISORIES [6]
ALL ADVISORIES, ORDERED by OCCURRENCE DURING 673 8AD's MOT HISTORY
Advisory Faults | source www.vehiclestats.co.uk
Fault Fault Test Date Test Date/Time Reference MOT Test Reference
1 Windscreen has damage to an area less than a 40mm circle outside zone 'a' (8.3.1d) Windscreen has damage to an area less than a 40mm circle outside zone 'a' (8.3.1d) 27 March 2014 [08:41] 27/03/2014 705306284032 705306284032
1 Offside rear brake fluctuating, but not excessively (3.7.b.3) Offside rear brake fluctuating, but not excessively (3.7.b.3) 27 March 2014 [08:41] 27/03/2014 705306284032 705306284032
1 Nearside front radius arm rubber mounting deteriorated but not resulting in excessive movement (2.4.g.2) Nearside front radius arm rubber mounting deteriorated but not resulting in excessive movement (2.4.g.2) 02 June 2007 [11:25] 02/06/2007 680413457149 680413457149
1 Offside front radius arm rubber mounting deteriorated but not resulting in excessive movement (2.4.g.2) Offside front radius arm rubber mounting deteriorated but not resulting in excessive movement (2.4.g.2) 02 June 2007 [11:25] 02/06/2007 680413457149 680413457149
1 Nearside front suspension arm rubber bush deteriorated but not resulting in excessive movement (2.4.g.2) Nearside front suspension arm rubber bush deteriorated but not resulting in excessive movement (2.4.g.2) 01 June 2007 [10:54] 01/06/2007 234932557464 234932557464
1 Offside front suspension arm rubber bush deteriorated but not resulting in excessive movement (2.4.g.2) Offside front suspension arm rubber bush deteriorated but not resulting in excessive movement (2.4.g.2) 01 June 2007 [10:54] 01/06/2007 234932557464 234932557464

ALL 673 8AD Failure Faults [14]

ALL Failure faults, ORDERED by OCCURRENCE DURING 673 8AD's MOT HISTORY
ALL 673 8AD Failure Faults [14]
ALL Failure faults, ORDERED by OCCURRENCE DURING 673 8AD's MOT HISTORY
Fail Faults | source www.vehiclestats.co.uk
Fault Fault Test Date Test Date/Time Reference MOT Test Reference
2 Nearside front wheel bearing rough when rotated (2.5.a.2) Nearside front wheel bearing rough when rotated (2.5.a.2) 24 April 2015 [12:58] 24/04/2015 01 June 2007 [10:54] 01/06/2007 348094115188 348094115188 234932557464 234932557464
1 Offside front wheel bearing rough when rotated (2.5.a.2) Offside front wheel bearing rough when rotated (2.5.a.2) 24 April 2015 [12:58] 24/04/2015 348094115188 348094115188
1 Nearside windscreen washer provides insufficient washer liquid (8.2.3) Nearside windscreen washer provides insufficient washer liquid (8.2.3) 15 April 2010 [15:58] 15/04/2010 944695900158 944695900158
1 Offside windscreen washer provides insufficient washer liquid (8.2.3) Offside windscreen washer provides insufficient washer liquid (8.2.3) 15 April 2010 [15:58] 15/04/2010 944695900158 944695900158
1 Brakes imbalanced across an axle (3.7.b.5b) Brakes imbalanced across an axle (3.7.b.5b) 15 April 2010 [15:58] 15/04/2010 944695900158 944695900158
1 Offside front suspension component mounting prescribed area is excessively corroded (2.4.a.3) Offside front suspension component mounting prescribed area is excessively corroded (2.4.a.3) 22 June 2009 [10:21] 22/06/2009 480243879146 480243879146
1 Offside rear suspension component mounting prescribed area is excessively corroded (2.4.a.3) Offside rear suspension component mounting prescribed area is excessively corroded (2.4.a.3) 22 June 2009 [10:21] 22/06/2009 480243879146 480243879146
1 Nearside rear shock absorber has negligible damping effect (2.7.5) Nearside rear shock absorber has negligible damping effect (2.7.5) 22 June 2009 [10:21] 22/06/2009 480243879146 480243879146
1 Offside rear shock absorber has negligible damping effect (2.7.5) Offside rear shock absorber has negligible damping effect (2.7.5) 22 June 2009 [10:21] 22/06/2009 480243879146 480243879146
1 Nearside rear suspension component mounting prescribed area is excessively corroded (2.4.a.3) Nearside rear suspension component mounting prescribed area is excessively corroded (2.4.a.3) 22 June 2009 [10:21] 22/06/2009 480243879146 480243879146
1 Windscreen washer provides insufficient washer liquid (8.2.3) Windscreen washer provides insufficient washer liquid (8.2.3) 01 June 2007 [10:54] 01/06/2007 234932557464 234932557464
1 Nearside front brake pipe seriously damaged (found during steering lock to lock check) (2.2.d.2b) Nearside front brake pipe seriously damaged (found during steering lock to lock check) (2.2.d.2b) 01 June 2007 [10:54] 01/06/2007 234932557464 234932557464
1 Nearside front suspension component mounting prescribed area is inadequately repaired (2.4.a.3) Nearside front suspension component mounting prescribed area is inadequately repaired (2.4.a.3) 01 June 2007 [10:54] 01/06/2007 234932557464 234932557464

ALL 673 8AD User Entered Faults [2]

ALL User Entered faults, ORDERED by OCCURRENCE DURING 673 8AD's MOT HISTORY
ALL 673 8AD User Entered Faults [2]
ALL User Entered faults, ORDERED by OCCURRENCE DURING 673 8AD's MOT HISTORY
Fail Faults | source www.vehiclestats.co.uk
Fault Fault Test Date Test Date/Time Reference MOT Test Reference
1 No passenger front seat fitted at time of test No passenger front seat fitted at time of test 15 April 2010 [15:58] 15/04/2010 944695900158 944695900158
1 Oil leak Oil leak 15 April 2010 [15:58] 15/04/2010 944695900158 944695900158

MOT TEST: 10 May 2018 09:00:41 PASSED
MOT TEST: 10 May 2018 09:00:41 PASSED

This test (575421190703) was completed on the 10 May 2018 09:00:41 and PASSED the requirements for a valid MOT with 0 comments.

This test (575421190703) was completed on the 10 May 2018 09:00:41 and PASSED the requirements for a valid MOT with 0 comments.

Recorded mileage: 19,505

Recorded mileage: 19,505


MOT TEST: 30 May 2017 15:34:53 PASSED
MOT TEST: 30 May 2017 15:34:53 PASSED

This test (957666257360) was completed on the 30 May 2017 15:34:53 and PASSED the requirements for a valid MOT with 0 comments.

This test (957666257360) was completed on the 30 May 2017 15:34:53 and PASSED the requirements for a valid MOT with 0 comments.

Recorded mileage: 17,942

Recorded mileage: 17,942


MOT TEST: 04 May 2016 13:15:42 PASSED
MOT TEST: 04 May 2016 13:15:42 PASSED

This test (276857983427) was completed on the 04 May 2016 13:15:42 and PASSED the requirements for a valid MOT with 0 comments.

This test (276857983427) was completed on the 04 May 2016 13:15:42 and PASSED the requirements for a valid MOT with 0 comments.

Recorded mileage: 15,642

Recorded mileage: 15,642


MOT TEST: 01 May 2015 12:42:44 PASSED
MOT TEST: 01 May 2015 12:42:44 PASSED

This test (277611425188) was completed on the 01 May 2015 12:42:44 and PASSED the requirements for a valid MOT with 0 comments.

This test (277611425188) was completed on the 01 May 2015 12:42:44 and PASSED the requirements for a valid MOT with 0 comments.

Recorded mileage: 13,376

Recorded mileage: 13,376


MOT TEST: 24 April 2015 12:58:07 FAILED
MOT TEST: 24 April 2015 12:58:07 FAILED

This test (348094115188) was completed on the 24 April 2015 12:58:07 and FAILED the requirements for a valid MOT with 2 comments.

This test (348094115188) was completed on the 24 April 2015 12:58:07 and FAILED the requirements for a valid MOT with 2 comments.

Recorded mileage: 13,366

Recorded mileage: 13,366


FAIL


MOT TEST: 27 March 2014 08:41:50 PASSED
MOT TEST: 27 March 2014 08:41:50 PASSED

This test (705306284032) was completed on the 27 March 2014 08:41:50 and PASSED the requirements for a valid MOT with 2 comments.

This test (705306284032) was completed on the 27 March 2014 08:41:50 and PASSED the requirements for a valid MOT with 2 comments.

Recorded mileage: 11,174

Recorded mileage: 11,174


ADVISORY


MOT TEST: 19 April 2013 10:05:07 PASSED
MOT TEST: 19 April 2013 10:05:07 PASSED

This test (256569903197) was completed on the 19 April 2013 10:05:07 and PASSED the requirements for a valid MOT with 0 comments.

This test (256569903197) was completed on the 19 April 2013 10:05:07 and PASSED the requirements for a valid MOT with 0 comments.

Recorded mileage: 10,527

Recorded mileage: 10,527


MOT TEST: 26 March 2012 11:53:07 PASSED
MOT TEST: 26 March 2012 11:53:07 PASSED

This test (318346282056) was completed on the 26 March 2012 11:53:07 and PASSED the requirements for a valid MOT with 0 comments.

This test (318346282056) was completed on the 26 March 2012 11:53:07 and PASSED the requirements for a valid MOT with 0 comments.

Recorded mileage: 9,718

Recorded mileage: 9,718


MOT TEST: 31 March 2011 08:47:53 PASSED
MOT TEST: 31 March 2011 08:47:53 PASSED

This test (169740691021) was completed on the 31 March 2011 08:47:53 and PASSED the requirements for a valid MOT with 0 comments.

This test (169740691021) was completed on the 31 March 2011 08:47:53 and PASSED the requirements for a valid MOT with 0 comments.

Recorded mileage: 7,554

Recorded mileage: 7,554


MOT TEST: 16 April 2010 15:17:53 PASSED
MOT TEST: 16 April 2010 15:17:53 PASSED

This test (313936800179) was completed on the 16 April 2010 15:17:53 and PASSED the requirements for a valid MOT with 0 comments.

This test (313936800179) was completed on the 16 April 2010 15:17:53 and PASSED the requirements for a valid MOT with 0 comments.

Recorded mileage: 4,560

Recorded mileage: 4,560


MOT TEST: 15 April 2010 15:58:51 FAILED
MOT TEST: 15 April 2010 15:58:51 FAILED

This test (944695900158) was completed on the 15 April 2010 15:58:51 and FAILED the requirements for a valid MOT with 5 comments.

This test (944695900158) was completed on the 15 April 2010 15:58:51 and FAILED the requirements for a valid MOT with 5 comments.

Recorded mileage: 4,554

Recorded mileage: 4,554


FAIL

USER ENTERED


MOT TEST: 22 June 2009 10:21:29 FAILED
MOT TEST: 22 June 2009 10:21:29 FAILED

This test (480243879146) was completed on the 22 June 2009 10:21:29 and FAILED the requirements for a valid MOT with 5 comments.

This test (480243879146) was completed on the 22 June 2009 10:21:29 and FAILED the requirements for a valid MOT with 5 comments.

Recorded mileage: 4,438

Recorded mileage: 4,438


FAIL


MOT TEST: 20 June 2008 08:55:31 PASSED
MOT TEST: 20 June 2008 08:55:31 PASSED

This test (470752078101) was completed on the 20 June 2008 08:55:31 and PASSED the requirements for a valid MOT with 0 comments.

This test (470752078101) was completed on the 20 June 2008 08:55:31 and PASSED the requirements for a valid MOT with 0 comments.

Recorded mileage: 3,734

Recorded mileage: 3,734


MOT TEST: 02 June 2007 11:25:09 PASSED
MOT TEST: 02 June 2007 11:25:09 PASSED

This test (680413457149) was completed on the 02 June 2007 11:25:09 and PASSED the requirements for a valid MOT with 2 comments.

This test (680413457149) was completed on the 02 June 2007 11:25:09 and PASSED the requirements for a valid MOT with 2 comments.

Recorded mileage: 2,167

Recorded mileage: 2,167


ADVISORY


MOT TEST: 01 June 2007 10:54:59 FAILED
MOT TEST: 01 June 2007 10:54:59 FAILED

This test (234932557464) was completed on the 01 June 2007 10:54:59 and FAILED the requirements for a valid MOT with 6 comments.

This test (234932557464) was completed on the 01 June 2007 10:54:59 and FAILED the requirements for a valid MOT with 6 comments.

Recorded mileage: 2,167

Recorded mileage: 2,167


ADVISORY

FAIL


MOT TEST: 25 April 2006 10:30:00 PASSED
MOT TEST: 25 April 2006 10:30:00 PASSED

This test (603035516155) was completed on the 25 April 2006 10:30:00 and PASSED the requirements for a valid MOT with 0 comments.

This test (603035516155) was completed on the 25 April 2006 10:30:00 and PASSED the requirements for a valid MOT with 0 comments.

Recorded mileage: 792

Recorded mileage: 792