673 UXM


673UXM is registered to a Green 1953, Morris Minor with a Petrol engine. It Failed its most recent MOT Test on the 18 September 2012

38 unique faults (42 Total) reported in its MOT History (10 Tests).

4 common/recurring faults, the most frequent (2 times) is: Fuel system component leaking (7.2.3).

50% (5) MOT Pass Rate and a 50% (5) MOT Failure Rate.

23,697 recorded miles.

673 UXM


673UXM is registered to a Green 1953, Morris Minor with a Petrol engine. It Failed its most recent MOT Test on the 18 September 2012

38 unique faults (42 Total) reported in its MOT History (10 Tests).

4 common/recurring faults, the most frequent (2 times) is: Fuel system component leaking (7.2.3).

50% (5) MOT Pass Rate and a 50% (5) MOT Failure Rate.

23,697 recorded miles.

MOT PASS/Failure rate for 673 UXM

all MOT test results for 673 UXM represented as a percentage
MOT PASS/Failure rate for 673 UXM
all MOT test results for 673 UXM represented as a percentage

PERCENTAGE OF VEHICLE FAULTS WITH 673 UXM

ALL REPORTED FAULTS, DISPLAYED BY PERCENTAGE OF OCCURRENCE DURING ALL MOT TESTS
PERCENTAGE OF VEHICLE FAULTS WITH 673 UXM
ALL REPORTED FAULTS, DISPLAYED BY PERCENTAGE OF OCCURRENCE DURING ALL MOT TESTS
ADVISORY

FAIL

USER ENTERED

673 UXM annual Faults by type

ALL REPORTED FAULTS, DISPLAYED over time and categorised by type
673 UXM annual Faults by type
ALL REPORTED FAULTS, DISPLAYED over time and categorised by type

RECURRING FAULTS WITH 673 UXM

FAULTS THAT HAVE OCCURED MORE THAN ONCE DURING 673 UXM's MOT HISTORY
RECURRING FAULTS WITH 673 UXM
FAULTS THAT HAVE OCCURED MORE THAN ONCE DURING 673 UXM's MOT HISTORY
Fault Fault Test Date Test Date/Time Reference MOT Test Reference
2 Fuel system component leaking (7.2.3) Fuel system component leaking (7.2.3) 05 October 2009 [16:25] 05/10/2009 29 July 2008 [09:05] 29/07/2008 950708579233 950708579233 670361618284 670361618284
2 Nearside headlamp aim beam image kick up to the offside (1.8) Nearside headlamp aim beam image kick up to the offside (1.8) 29 July 2008 [09:05] 29/07/2008 12 July 2008 [13:25] 12/07/2008 670361618284 670361618284 523954598103 523954598103
2 Offside headlamp aim beam image kick up to the offside (1.8) Offside headlamp aim beam image kick up to the offside (1.8) 29 July 2008 [09:05] 29/07/2008 12 July 2008 [13:25] 12/07/2008 670361618284 670361618284 523954598103 523954598103
2 Brakes imbalanced across an axle (3.7.b.5b) Brakes imbalanced across an axle (3.7.b.5b) 29 July 2008 [09:05] 29/07/2008 12 July 2008 [13:25] 12/07/2008 670361618284 670361618284 523954598103 523954598103

ALL 673 UXM ADVISORIES [3]

ALL ADVISORIES, ORDERED by OCCURRENCE DURING 673 UXM's MOT HISTORY
ALL 673 UXM ADVISORIES [3]
ALL ADVISORIES, ORDERED by OCCURRENCE DURING 673 UXM's MOT HISTORY
Advisory Faults | source www.vehiclestats.co.uk
Fault Fault Test Date Test Date/Time Reference MOT Test Reference
1 Front front wheel bearing has slight play (2.5.a.3c) Front front wheel bearing has slight play (2.5.a.3c) 18 September 2012 [11:30] 18/09/2012 256212762252 256212762252
1 Rear front wheel bearing has slight play (2.5.a.3c) Rear front wheel bearing has slight play (2.5.a.3c) 18 September 2012 [11:30] 18/09/2012 256212762252 256212762252
1 Offside front wheel bearing has slight play (2.5.a.3c) Offside front wheel bearing has slight play (2.5.a.3c) 02 August 2006 [11:51] 02/08/2006 771994416277 771994416277

ALL 673 UXM Failure Faults [33]

ALL Failure faults, ORDERED by OCCURRENCE DURING 673 UXM's MOT HISTORY
ALL 673 UXM Failure Faults [33]
ALL Failure faults, ORDERED by OCCURRENCE DURING 673 UXM's MOT HISTORY
Fail Faults | source www.vehiclestats.co.uk
Fault Fault Test Date Test Date/Time Reference MOT Test Reference
2 Fuel system component leaking (7.2.3) Fuel system component leaking (7.2.3) 05 October 2009 [16:25] 05/10/2009 29 July 2008 [09:05] 29/07/2008 950708579233 950708579233 670361618284 670361618284
2 Nearside headlamp aim beam image kick up to the offside (1.8) Nearside headlamp aim beam image kick up to the offside (1.8) 29 July 2008 [09:05] 29/07/2008 12 July 2008 [13:25] 12/07/2008 670361618284 670361618284 523954598103 523954598103
2 Offside headlamp aim beam image kick up to the offside (1.8) Offside headlamp aim beam image kick up to the offside (1.8) 29 July 2008 [09:05] 29/07/2008 12 July 2008 [13:25] 12/07/2008 670361618284 670361618284 523954598103 523954598103
2 Brakes imbalanced across an axle (3.7.b.5b) Brakes imbalanced across an axle (3.7.b.5b) 29 July 2008 [09:05] 29/07/2008 12 July 2008 [13:25] 12/07/2008 670361618284 670361618284 523954598103 523954598103
1 Nearside front position lamp(s) not working (1.1.a.3b) Nearside front position lamp(s) not working (1.1.a.3b) 17 September 2012 [10:32] 17/09/2012 347411262491 347411262491
1 Offside front position lamp(s) not working (1.1.a.3b) Offside front position lamp(s) not working (1.1.a.3b) 17 September 2012 [10:32] 17/09/2012 347411262491 347411262491
1 Nearside rear position lamp(s) not working (1.1.a.3b) Nearside rear position lamp(s) not working (1.1.a.3b) 17 September 2012 [10:32] 17/09/2012 347411262491 347411262491
1 Offside rear position lamp(s) not working (1.1.a.3b) Offside rear position lamp(s) not working (1.1.a.3b) 17 September 2012 [10:32] 17/09/2012 347411262491 347411262491
1 Centre rear registration plate lamp not working (1.1.c.1d) Centre rear registration plate lamp not working (1.1.c.1d) 17 September 2012 [10:32] 17/09/2012 347411262491 347411262491
1 Nearside headlamp not working on dipped beam (1.7.5a) Nearside headlamp not working on dipped beam (1.7.5a) 17 September 2012 [10:32] 17/09/2012 347411262491 347411262491
1 Offside headlamp not working on dipped beam (1.7.5a) Offside headlamp not working on dipped beam (1.7.5a) 17 September 2012 [10:32] 17/09/2012 347411262491 347411262491
1 Offside headlamp not working on main beam (1.7.5a) Offside headlamp not working on main beam (1.7.5a) 17 September 2012 [10:32] 17/09/2012 347411262491 347411262491
1 Nearside headlamp not working on main beam (1.7.5a) Nearside headlamp not working on main beam (1.7.5a) 17 September 2012 [10:32] 17/09/2012 347411262491 347411262491
1 Nearside steering system fouling (2.2.d.2a) Nearside steering system fouling (2.2.d.2a) 17 September 2012 [10:32] 17/09/2012 347411262491 347411262491
1 Headlamp aim not tested (1.8.a.1c) Headlamp aim not tested (1.8.a.1c) 17 September 2012 [10:32] 17/09/2012 347411262491 347411262491
1 Fuel cap/sealing device sealing washer deteriorated (7.2.4c) Fuel cap/sealing device sealing washer deteriorated (7.2.4c) 29 July 2008 [09:05] 29/07/2008 670361618284 670361618284
1 Nearside shock absorber insecure (2.7.2b) Nearside shock absorber insecure (2.7.2b) 29 July 2008 [09:05] 29/07/2008 670361618284 670361618284
1 Offside shock absorber insecure (2.7.2b) Offside shock absorber insecure (2.7.2b) 29 July 2008 [09:05] 29/07/2008 670361618284 670361618284
1 Nearside suspension arm rubber mounting deteriorated resulting in excessive movement (2.4.g.2) Nearside suspension arm rubber mounting deteriorated resulting in excessive movement (2.4.g.2) 29 July 2008 [09:05] 29/07/2008 670361618284 670361618284
1 Offside suspension arm rubber mounting deteriorated resulting in excessive movement (2.4.g.2) Offside suspension arm rubber mounting deteriorated resulting in excessive movement (2.4.g.2) 29 July 2008 [09:05] 29/07/2008 670361618284 670361618284
1 Offside front brake recording little or no effort (3.7.b.5a) Offside front brake recording little or no effort (3.7.b.5a) 29 July 2008 [09:05] 29/07/2008 670361618284 670361618284
1 Nearside front brake binding (3.7.b.1) Nearside front brake binding (3.7.b.1) 29 July 2008 [09:05] 29/07/2008 670361618284 670361618284
1 Fuel cap/sealing device sealing washer missing (7.2.4c) Fuel cap/sealing device sealing washer missing (7.2.4c) 12 July 2008 [13:25] 12/07/2008 523954598103 523954598103
1 Nearside front tie bar/rod rubber bush deteriorated resulting in excessive movement (2.4.g.2) Nearside front tie bar/rod rubber bush deteriorated resulting in excessive movement (2.4.g.2) 12 July 2008 [13:25] 12/07/2008 523954598103 523954598103
1 Offside front tie bar/rod rubber bush deteriorated resulting in excessive movement (2.4.g.2) Offside front tie bar/rod rubber bush deteriorated resulting in excessive movement (2.4.g.2) 12 July 2008 [13:25] 12/07/2008 523954598103 523954598103
1 Front brake binding (3.7.b.1) Front brake binding (3.7.b.1) 12 July 2008 [13:25] 12/07/2008 523954598103 523954598103
1 Offside front front brake recording little or no effort (3.7.b.5a) Offside front front brake recording little or no effort (3.7.b.5a) 12 July 2008 [13:25] 12/07/2008 523954598103 523954598103
1 Nearside semaphore indicator arm does not extend smoothly (1.4.c.1a) Nearside semaphore indicator arm does not extend smoothly (1.4.c.1a) 02 August 2006 [11:51] 02/08/2006 771994416277 771994416277
1 Offside windscreen washer provides insufficient washer liquid (8.2.3) Offside windscreen washer provides insufficient washer liquid (8.2.3) 02 August 2006 [11:51] 02/08/2006 771994416277 771994416277

ALL 673 UXM User Entered Faults [6]

ALL User Entered faults, ORDERED by OCCURRENCE DURING 673 UXM's MOT HISTORY
ALL 673 UXM User Entered Faults [6]
ALL User Entered faults, ORDERED by OCCURRENCE DURING 673 UXM's MOT HISTORY
Fail Faults | source www.vehiclestats.co.uk
Fault Fault Test Date Test Date/Time Reference MOT Test Reference
1 All wheel bearings have a slight play All wheel bearings have a slight play 17 September 2012 [10:32] 17/09/2012 347411262491 347411262491
1 Steering rack fouled by electrical wires on the nearside Steering rack fouled by electrical wires on the nearside 03 October 2011 [18:02] 03/10/2011 425406071209 425406071209
1 Rust under vehicle nearside front and offside front Rust under vehicle nearside front and offside front 03 October 2011 [18:02] 03/10/2011 425406071209 425406071209
1 Slight play in front wheel bearings/suspension joints Slight play in front wheel bearings/suspension joints 05 October 2009 [16:25] 05/10/2009 950708579233 950708579233
1 Offside rear door can not open Offside rear door can not open 12 July 2008 [13:25] 12/07/2008 523954598103 523954598103
1 Rear spring hanger bushes siart to perish Rear spring hanger bushes siart to perish 02 August 2006 [11:51] 02/08/2006 771994416277 771994416277

MOT TEST: 18 September 2012 11:30:48 PASSED
MOT TEST: 18 September 2012 11:30:48 PASSED

This test (256212762252) was completed on the 18 September 2012 11:30:48 and PASSED the requirements for a valid MOT with 2 comments.

This test (256212762252) was completed on the 18 September 2012 11:30:48 and PASSED the requirements for a valid MOT with 2 comments.

Recorded mileage: 23,697

Recorded mileage: 23,697


ADVISORY


MOT TEST: 17 September 2012 10:32:07 FAILED
MOT TEST: 17 September 2012 10:32:07 FAILED

This test (347411262491) was completed on the 17 September 2012 10:32:07 and FAILED the requirements for a valid MOT with 12 comments.

This test (347411262491) was completed on the 17 September 2012 10:32:07 and FAILED the requirements for a valid MOT with 12 comments.

Recorded mileage: 23,683

Recorded mileage: 23,683


FAIL

USER ENTERED


MOT TEST: 03 October 2011 18:02:41 PASSED
MOT TEST: 03 October 2011 18:02:41 PASSED

This test (425406071209) was completed on the 03 October 2011 18:02:41 and PASSED the requirements for a valid MOT with 2 comments.

This test (425406071209) was completed on the 03 October 2011 18:02:41 and PASSED the requirements for a valid MOT with 2 comments.

Recorded mileage: 23,650

Recorded mileage: 23,650


USER ENTERED


MOT TEST: 08 October 2009 15:51:39 PASSED
MOT TEST: 08 October 2009 15:51:39 PASSED

This test (894831289246) was completed on the 08 October 2009 15:51:39 and PASSED the requirements for a valid MOT with 0 comments.

This test (894831289246) was completed on the 08 October 2009 15:51:39 and PASSED the requirements for a valid MOT with 0 comments.

Recorded mileage: 23,634

Recorded mileage: 23,634


MOT TEST: 05 October 2009 16:25:51 FAILED
MOT TEST: 05 October 2009 16:25:51 FAILED

This test (950708579233) was completed on the 05 October 2009 16:25:51 and FAILED the requirements for a valid MOT with 2 comments.

This test (950708579233) was completed on the 05 October 2009 16:25:51 and FAILED the requirements for a valid MOT with 2 comments.

Recorded mileage: 23,634

Recorded mileage: 23,634


FAIL

USER ENTERED


MOT TEST: 01 August 2008 11:26:09 PASSED
MOT TEST: 01 August 2008 11:26:09 PASSED

This test (813814718296) was completed on the 01 August 2008 11:26:09 and PASSED the requirements for a valid MOT with 0 comments.

This test (813814718296) was completed on the 01 August 2008 11:26:09 and PASSED the requirements for a valid MOT with 0 comments.

Recorded mileage: 23,276

Recorded mileage: 23,276


MOT TEST: 29 July 2008 09:05:16 FAILED
MOT TEST: 29 July 2008 09:05:16 FAILED

This test (670361618284) was completed on the 29 July 2008 09:05:16 and FAILED the requirements for a valid MOT with 11 comments.

This test (670361618284) was completed on the 29 July 2008 09:05:16 and FAILED the requirements for a valid MOT with 11 comments.

Recorded mileage: 23,271

Recorded mileage: 23,271


FAIL


MOT TEST: 12 July 2008 13:25:39 FAILED
MOT TEST: 12 July 2008 13:25:39 FAILED

This test (523954598103) was completed on the 12 July 2008 13:25:39 and FAILED the requirements for a valid MOT with 9 comments.

This test (523954598103) was completed on the 12 July 2008 13:25:39 and FAILED the requirements for a valid MOT with 9 comments.

Recorded mileage: 23,087

Recorded mileage: 23,087


FAIL

USER ENTERED


MOT TEST: 02 August 2006 17:46:38 PASSED
MOT TEST: 02 August 2006 17:46:38 PASSED

This test (124684916203) was completed on the 02 August 2006 17:46:38 and PASSED the requirements for a valid MOT with 0 comments.

This test (124684916203) was completed on the 02 August 2006 17:46:38 and PASSED the requirements for a valid MOT with 0 comments.

Recorded mileage: 22,820

Recorded mileage: 22,820


MOT TEST: 02 August 2006 11:51:26 FAILED
MOT TEST: 02 August 2006 11:51:26 FAILED

This test (771994416277) was completed on the 02 August 2006 11:51:26 and FAILED the requirements for a valid MOT with 4 comments.

This test (771994416277) was completed on the 02 August 2006 11:51:26 and FAILED the requirements for a valid MOT with 4 comments.

Recorded mileage: 22,820

Recorded mileage: 22,820


ADVISORY

FAIL

USER ENTERED