673 UXV


673UXV is registered to a Blue 1971, Morris 1000 with a Petrol engine. It Failed its most recent MOT Test on the 24 March 2007

16 unique faults (17 Total) reported in its MOT History (3 Tests).

0 common/recurring faults.

33% (1) MOT Pass Rate and a 67% (2) MOT Failure Rate.

17,981 recorded miles.

673 UXV


673UXV is registered to a Blue 1971, Morris 1000 with a Petrol engine. It Failed its most recent MOT Test on the 24 March 2007

16 unique faults (17 Total) reported in its MOT History (3 Tests).

0 common/recurring faults.

33% (1) MOT Pass Rate and a 67% (2) MOT Failure Rate.

17,981 recorded miles.

MOT PASS/Failure rate for 673 UXV

all MOT test results for 673 UXV represented as a percentage
MOT PASS/Failure rate for 673 UXV
all MOT test results for 673 UXV represented as a percentage

PERCENTAGE OF VEHICLE FAULTS WITH 673 UXV

ALL REPORTED FAULTS, DISPLAYED BY PERCENTAGE OF OCCURRENCE DURING ALL MOT TESTS
PERCENTAGE OF VEHICLE FAULTS WITH 673 UXV
ALL REPORTED FAULTS, DISPLAYED BY PERCENTAGE OF OCCURRENCE DURING ALL MOT TESTS
FAIL

673 UXV annual Faults by type

ALL REPORTED FAULTS, DISPLAYED over time and categorised by type
673 UXV annual Faults by type
ALL REPORTED FAULTS, DISPLAYED over time and categorised by type

ALL 673 UXV Failure Faults [17]

ALL Failure faults, ORDERED by OCCURRENCE DURING 673 UXV's MOT HISTORY
ALL 673 UXV Failure Faults [17]
ALL Failure faults, ORDERED by OCCURRENCE DURING 673 UXV's MOT HISTORY
Fail Faults | source www.vehiclestats.co.uk
Fault Fault Test Date Test Date/Time Reference MOT Test Reference
1 Nearside front front position lamp(s) not working (1.1.a.3b) Nearside front front position lamp(s) not working (1.1.a.3b) 16 November 2006 [16:01] 16/11/2006 942790326381 942790326381
1 Nearside front position lamp(s) not working (1.1.a.3b) Nearside front position lamp(s) not working (1.1.a.3b) 16 November 2006 [16:01] 16/11/2006 942790326381 942790326381
1 Nearside windscreen wiper blade deteriorated (8.2.2) Nearside windscreen wiper blade deteriorated (8.2.2) 16 November 2006 [16:01] 16/11/2006 942790326381 942790326381
1 Tyre has ply or cords exposed (4.1.d.1b) Tyre has ply or cords exposed (4.1.d.1b) 16 November 2006 [16:01] 16/11/2006 942790326381 942790326381
1 Offside rear suspension spring mounting prescribed area is excessively corroded (2.4.a.3) Offside rear suspension spring mounting prescribed area is excessively corroded (2.4.a.3) 16 November 2006 [16:01] 16/11/2006 942790326381 942790326381
1 Nearside rear suspension spring mounting prescribed area is excessively corroded (2.4.a.3) Nearside rear suspension spring mounting prescribed area is excessively corroded (2.4.a.3) 16 November 2006 [16:01] 16/11/2006 942790326381 942790326381
1 Nearside front brake hose excessively deteriorated (3.6.b.4d) Nearside front brake hose excessively deteriorated (3.6.b.4d) 16 November 2006 [16:01] 16/11/2006 942790326381 942790326381
1 Offside front headlamp not working on dipped beam (1.7.5a) Offside front headlamp not working on dipped beam (1.7.5a) 21 October 2006 [09:30] 21/10/2006 132104596269 132104596269
1 Nearside front lower body or chassis has excessive corrosion, seriously affecting its strength within 30cm of the body mountings (6.1.b.2) Nearside front lower body or chassis has excessive corrosion, seriously affecting its strength within 30cm of the body mountings (6.1.b.2) 21 October 2006 [09:30] 21/10/2006 132104596269 132104596269
1 Offside front lower body or chassis has excessive corrosion, seriously affecting its strength within 30cm of the body mountings (6.1.b.2) Offside front lower body or chassis has excessive corrosion, seriously affecting its strength within 30cm of the body mountings (6.1.b.2) 21 October 2006 [09:30] 21/10/2006 132104596269 132104596269
1 Nearside rear lower body or chassis has excessive corrosion, seriously affecting its strength within 30cm of the body mountings (6.1.b.2) Nearside rear lower body or chassis has excessive corrosion, seriously affecting its strength within 30cm of the body mountings (6.1.b.2) 21 October 2006 [09:30] 21/10/2006 132104596269 132104596269
1 Offside rear lower body or chassis has excessive corrosion, seriously affecting its strength within 30cm of the body mountings (6.1.b.2) Offside rear lower body or chassis has excessive corrosion, seriously affecting its strength within 30cm of the body mountings (6.1.b.2) 21 October 2006 [09:30] 21/10/2006 132104596269 132104596269
1 Nearside front tyre tread depth below requirements of 1.6mm (4.1.e.1) Nearside front tyre tread depth below requirements of 1.6mm (4.1.e.1) 21 October 2006 [09:30] 21/10/2006 132104596269 132104596269
1 Nearside rear tyre tread depth below requirements of 1.6mm (4.1.e.1) Nearside rear tyre tread depth below requirements of 1.6mm (4.1.e.1) 21 October 2006 [09:30] 21/10/2006 132104596269 132104596269
1 Offside rear tyre tread depth below requirements of 1.6mm (4.1.e.1) Offside rear tyre tread depth below requirements of 1.6mm (4.1.e.1) 21 October 2006 [09:30] 21/10/2006 132104596269 132104596269
1 Nearside tyre tread depth below requirements of 1.6mm (4.1.e.1) Nearside tyre tread depth below requirements of 1.6mm (4.1.e.1) 21 October 2006 [09:30] 21/10/2006 132104596269 132104596269

MOT TEST: 24 March 2007 17:33:48 PASSED
MOT TEST: 24 March 2007 17:33:48 PASSED

This test (670543687019) was completed on the 24 March 2007 17:33:48 and PASSED the requirements for a valid MOT with 0 comments.

This test (670543687019) was completed on the 24 March 2007 17:33:48 and PASSED the requirements for a valid MOT with 0 comments.

Recorded mileage: 17,981

Recorded mileage: 17,981


MOT TEST: 16 November 2006 16:01:12 FAILED
MOT TEST: 16 November 2006 16:01:12 FAILED

This test (942790326381) was completed on the 16 November 2006 16:01:12 and FAILED the requirements for a valid MOT with 8 comments.

This test (942790326381) was completed on the 16 November 2006 16:01:12 and FAILED the requirements for a valid MOT with 8 comments.

Recorded mileage: 1,796

Recorded mileage: 1,796


FAIL


MOT TEST: 21 October 2006 09:30:46 FAILED
MOT TEST: 21 October 2006 09:30:46 FAILED

This test (132104596269) was completed on the 21 October 2006 09:30:46 and FAILED the requirements for a valid MOT with 9 comments.

This test (132104596269) was completed on the 21 October 2006 09:30:46 and FAILED the requirements for a valid MOT with 9 comments.

Recorded mileage: 1,725

Recorded mileage: 1,725


FAIL