674 CHP


674CHP is registered to a Blue 1963, Morris Minor 1000 with a Petrol engine. It Failed its most recent MOT Test on the 23 August 2011

24 unique faults (30 Total) reported in its MOT History (8 Tests).

4 common/recurring faults, the most frequent (4 times) is: Offside Front Seat belt damaged but webbing not significantly weakened (5.2.2a).

62% (5) MOT Pass Rate and a 38% (3) MOT Failure Rate.

75,464 recorded miles.

674 CHP


674CHP is registered to a Blue 1963, Morris Minor 1000 with a Petrol engine. It Failed its most recent MOT Test on the 23 August 2011

24 unique faults (30 Total) reported in its MOT History (8 Tests).

4 common/recurring faults, the most frequent (4 times) is: Offside Front Seat belt damaged but webbing not significantly weakened (5.2.2a).

62% (5) MOT Pass Rate and a 38% (3) MOT Failure Rate.

75,464 recorded miles.

MOT PASS/Failure rate for 674 CHP

all MOT test results for 674 CHP represented as a percentage
MOT PASS/Failure rate for 674 CHP
all MOT test results for 674 CHP represented as a percentage

PERCENTAGE OF VEHICLE FAULTS WITH 674 CHP

ALL REPORTED FAULTS, DISPLAYED BY PERCENTAGE OF OCCURRENCE DURING ALL MOT TESTS
PERCENTAGE OF VEHICLE FAULTS WITH 674 CHP
ALL REPORTED FAULTS, DISPLAYED BY PERCENTAGE OF OCCURRENCE DURING ALL MOT TESTS
ADVISORY

FAIL

USER ENTERED

674 CHP annual Faults by type

ALL REPORTED FAULTS, DISPLAYED over time and categorised by type
674 CHP annual Faults by type
ALL REPORTED FAULTS, DISPLAYED over time and categorised by type

RECURRING FAULTS WITH 674 CHP

FAULTS THAT HAVE OCCURED MORE THAN ONCE DURING 674 CHP's MOT HISTORY
RECURRING FAULTS WITH 674 CHP
FAULTS THAT HAVE OCCURED MORE THAN ONCE DURING 674 CHP's MOT HISTORY
Fault Fault Test Date Test Date/Time Reference MOT Test Reference
4 Offside front seat belt damaged but webbing not significantly weakened (5.2.2a) Offside front seat belt damaged but webbing not significantly weakened (5.2.2a) 20 November 2009 [16:08] 20/11/2009 09 November 2009 [16:22] 09/11/2009 11 September 2008 [13:37] 11/09/2008 28 August 2008 [11:42] 28/08/2008 891364729357 891364729357 431623619362 431623619362 350245458480 350245458480 281871348244 281871348244
2 Headlamp main beam warning lamp not working Headlamp main beam warning lamp not working 20 November 2009 [16:08] 20/11/2009 09 November 2009 [16:22] 09/11/2009 891364729357 891364729357 431623619362 431623619362
2 Nearside front tyre worn close to the legal limit (4.1.e.1) Nearside front tyre worn close to the legal limit (4.1.e.1) 11 September 2008 [13:37] 11/09/2008 28 August 2008 [11:42] 28/08/2008 350245458480 350245458480 281871348244 281871348244
2 Windscreen washer provides insufficient washer liquid (8.2.3) Windscreen washer provides insufficient washer liquid (8.2.3) 28 August 2008 [11:42] 28/08/2008 15 August 2007 [12:31] 15/08/2007 281871348244 281871348244 183037727219 183037727219

ALL 674 CHP ADVISORIES [6]

ALL ADVISORIES, ORDERED by OCCURRENCE DURING 674 CHP's MOT HISTORY
ALL 674 CHP ADVISORIES [6]
ALL ADVISORIES, ORDERED by OCCURRENCE DURING 674 CHP's MOT HISTORY
Advisory Faults | source www.vehiclestats.co.uk
Fault Fault Test Date Test Date/Time Reference MOT Test Reference
4 Offside front seat belt damaged but webbing not significantly weakened (5.2.2a) Offside front seat belt damaged but webbing not significantly weakened (5.2.2a) 20 November 2009 [16:08] 20/11/2009 09 November 2009 [16:22] 09/11/2009 11 September 2008 [13:37] 11/09/2008 28 August 2008 [11:42] 28/08/2008 891364729357 891364729357 431623619362 431623619362 350245458480 350245458480 281871348244 281871348244
2 Nearside front tyre worn close to the legal limit (4.1.e.1) Nearside front tyre worn close to the legal limit (4.1.e.1) 11 September 2008 [13:37] 11/09/2008 28 August 2008 [11:42] 28/08/2008 350245458480 350245458480 281871348244 281871348244

ALL 674 CHP Failure Faults [19]

ALL Failure faults, ORDERED by OCCURRENCE DURING 674 CHP's MOT HISTORY
ALL 674 CHP Failure Faults [19]
ALL Failure faults, ORDERED by OCCURRENCE DURING 674 CHP's MOT HISTORY
Fail Faults | source www.vehiclestats.co.uk
Fault Fault Test Date Test Date/Time Reference MOT Test Reference
2 Windscreen washer provides insufficient washer liquid (8.2.3) Windscreen washer provides insufficient washer liquid (8.2.3) 28 August 2008 [11:42] 28/08/2008 15 August 2007 [12:31] 15/08/2007 281871348244 281871348244 183037727219 183037727219
1 Fuel cap/sealing device does not fasten securely maintaining the sealing arrangement (7.2.4b) Fuel cap/sealing device does not fasten securely maintaining the sealing arrangement (7.2.4b) 09 November 2009 [16:22] 09/11/2009 431623619362 431623619362
1 Nearside front vehicle structure has excessive corrosion which adversely affects braking or steering (6.1.a.1) Nearside front vehicle structure has excessive corrosion which adversely affects braking or steering (6.1.a.1) 09 November 2009 [16:22] 09/11/2009 431623619362 431623619362
1 Nearside front vehicle structure has an inadequate repair which adversely affects braking or steering (6.1.a.1) Nearside front vehicle structure has an inadequate repair which adversely affects braking or steering (6.1.a.1) 09 November 2009 [16:22] 09/11/2009 431623619362 431623619362
1 Offside rear suspension component mounting prescribed area is excessively corroded (2.4.a.3) Offside rear suspension component mounting prescribed area is excessively corroded (2.4.a.3) 09 November 2009 [16:22] 09/11/2009 431623619362 431623619362
1 Nearside front suspension component mounting prescribed area is excessively corroded (2.4.a.3) Nearside front suspension component mounting prescribed area is excessively corroded (2.4.a.3) 09 November 2009 [16:22] 09/11/2009 431623619362 431623619362
1 Nearside front mechanical brake component has restricted free movement (3.5.1k) Nearside front mechanical brake component has restricted free movement (3.5.1k) 09 November 2009 [16:22] 09/11/2009 431623619362 431623619362
1 Parking brake: efficiency below requirements (3.7.b.7) Parking brake: efficiency below requirements (3.7.b.7) 09 November 2009 [16:22] 09/11/2009 431623619362 431623619362
1 Brakes imbalanced across an axle (3.7.b.5b) Brakes imbalanced across an axle (3.7.b.5b) 09 November 2009 [16:22] 09/11/2009 431623619362 431623619362
1 Nearside headlamp not working on dipped beam (1.7.5a) Nearside headlamp not working on dipped beam (1.7.5a) 28 August 2008 [11:42] 28/08/2008 281871348244 281871348244
1 Offside rear suspension spring mounting prescribed area is excessively corroded (2.4.a.3) Offside rear suspension spring mounting prescribed area is excessively corroded (2.4.a.3) 28 August 2008 [11:42] 28/08/2008 281871348244 281871348244
1 Nearside front upper front suspension locking device missing (2.5.a.4) Nearside front upper front suspension locking device missing (2.5.a.4) 28 August 2008 [11:42] 28/08/2008 281871348244 281871348244
1 Nearside steering locking device missing (2.2.c.1g) Nearside steering locking device missing (2.2.c.1g) 28 August 2008 [11:42] 28/08/2008 281871348244 281871348244
1 Offside steering locking device missing (2.2.c.1g) Offside steering locking device missing (2.2.c.1g) 28 August 2008 [11:42] 28/08/2008 281871348244 281871348244
1 Nearside steering rack gaiter split (2.2.d.2d) Nearside steering rack gaiter split (2.2.d.2d) 28 August 2008 [11:42] 28/08/2008 281871348244 281871348244
1 Headlamp not working on main beam (1.7.5a) Headlamp not working on main beam (1.7.5a) 28 August 2008 [11:42] 28/08/2008 281871348244 281871348244
1 Offside windscreen wiper does not clear the windscreen effectively (8.2.2) Offside windscreen wiper does not clear the windscreen effectively (8.2.2) 15 August 2007 [12:31] 15/08/2007 183037727219 183037727219
1 Offside front suspension component mounting prescribed area is excessively corroded (2.4.a.3) Offside front suspension component mounting prescribed area is excessively corroded (2.4.a.3) 15 August 2007 [12:31] 15/08/2007 183037727219 183037727219

ALL 674 CHP User Entered Faults [5]

ALL User Entered faults, ORDERED by OCCURRENCE DURING 674 CHP's MOT HISTORY
ALL 674 CHP User Entered Faults [5]
ALL User Entered faults, ORDERED by OCCURRENCE DURING 674 CHP's MOT HISTORY
Advisory Faults | source www.vehiclestats.co.uk
Fault Fault Test Date Test Date/Time Reference MOT Test Reference
2 Headlamp main beam warning lamp not working Headlamp main beam warning lamp not working 20 November 2009 [16:08] 20/11/2009 09 November 2009 [16:22] 09/11/2009 891364729357 891364729357 431623619362 431623619362
1 Battery insecure Battery insecure 09 November 2009 [16:22] 09/11/2009 431623619362 431623619362
1 Full beam tell tale warning light inop Full beam tell tale warning light inop 11 September 2008 [13:37] 11/09/2008 350245458480 350245458480
1 1)n/s/f and n/s/r inner wheel arches and o/s/f inner wheeel arch are all corroded.2)o/s/f bump stop area is corroded 1)n/s/f and n/s/r inner wheel arches and o/s/f inner wheeel arch are all corroded.2)o/s/f bump stop area is corroded 15 August 2007 [12:31] 15/08/2007 183037727219 183037727219

MOT TEST: 23 August 2011 14:18:15 PASSED
MOT TEST: 23 August 2011 14:18:15 PASSED

This test (329205231261) was completed on the 23 August 2011 14:18:15 and PASSED the requirements for a valid MOT with 0 comments.

This test (329205231261) was completed on the 23 August 2011 14:18:15 and PASSED the requirements for a valid MOT with 0 comments.

Recorded mileage: 75,464

Recorded mileage: 75,464


MOT TEST: 20 November 2009 16:08:26 PASSED
MOT TEST: 20 November 2009 16:08:26 PASSED

This test (891364729357) was completed on the 20 November 2009 16:08:26 and PASSED the requirements for a valid MOT with 2 comments.

This test (891364729357) was completed on the 20 November 2009 16:08:26 and PASSED the requirements for a valid MOT with 2 comments.

Recorded mileage: 75,058

Recorded mileage: 75,058


ADVISORY

USER ENTERED


MOT TEST: 09 November 2009 16:22:55 FAILED
MOT TEST: 09 November 2009 16:22:55 FAILED

This test (431623619362) was completed on the 09 November 2009 16:22:55 and FAILED the requirements for a valid MOT with 11 comments.

This test (431623619362) was completed on the 09 November 2009 16:22:55 and FAILED the requirements for a valid MOT with 11 comments.

Recorded mileage: 75,053

Recorded mileage: 75,053


ADVISORY

FAIL

USER ENTERED


MOT TEST: 11 September 2008 13:37:57 PASSED
MOT TEST: 11 September 2008 13:37:57 PASSED

This test (350245458480) was completed on the 11 September 2008 13:37:57 and PASSED the requirements for a valid MOT with 3 comments.

This test (350245458480) was completed on the 11 September 2008 13:37:57 and PASSED the requirements for a valid MOT with 3 comments.

Recorded mileage: 73,169

Recorded mileage: 73,169


ADVISORY

USER ENTERED


MOT TEST: 28 August 2008 11:42:55 FAILED
MOT TEST: 28 August 2008 11:42:55 FAILED

This test (281871348244) was completed on the 28 August 2008 11:42:55 and FAILED the requirements for a valid MOT with 10 comments.

This test (281871348244) was completed on the 28 August 2008 11:42:55 and FAILED the requirements for a valid MOT with 10 comments.

Recorded mileage: 73,164

Recorded mileage: 73,164


ADVISORY

FAIL


MOT TEST: 21 August 2007 10:33:50 PASSED
MOT TEST: 21 August 2007 10:33:50 PASSED

This test (770623337286) was completed on the 21 August 2007 10:33:50 and PASSED the requirements for a valid MOT with 0 comments.

This test (770623337286) was completed on the 21 August 2007 10:33:50 and PASSED the requirements for a valid MOT with 0 comments.

Recorded mileage: 71,613

Recorded mileage: 71,613


MOT TEST: 15 August 2007 12:31:03 FAILED
MOT TEST: 15 August 2007 12:31:03 FAILED

This test (183037727219) was completed on the 15 August 2007 12:31:03 and FAILED the requirements for a valid MOT with 4 comments.

This test (183037727219) was completed on the 15 August 2007 12:31:03 and FAILED the requirements for a valid MOT with 4 comments.

Recorded mileage: 71,608

Recorded mileage: 71,608


FAIL

USER ENTERED


MOT TEST: 15 August 2006 10:22:56 PASSED
MOT TEST: 15 August 2006 10:22:56 PASSED

This test (313347726419) was completed on the 15 August 2006 10:22:56 and PASSED the requirements for a valid MOT with 0 comments.

This test (313347726419) was completed on the 15 August 2006 10:22:56 and PASSED the requirements for a valid MOT with 0 comments.

Recorded mileage: 71,110

Recorded mileage: 71,110