674 CPX


674CPX is registered to a Green 1961, Morris Minor 1000 with a Petrol engine. It Failed its most recent MOT Test on the 19 July 2017

15 unique faults (20 Total) reported in its MOT History (4 Tests).

5 common/recurring faults, the most frequent (2 times) is: Nearside Front Seat belt stitching slightly frayed (5.2.2b).

50% (2) MOT Pass Rate and a 50% (2) MOT Failure Rate.

34,660 recorded miles.

674 CPX


674CPX is registered to a Green 1961, Morris Minor 1000 with a Petrol engine. It Failed its most recent MOT Test on the 19 July 2017

15 unique faults (20 Total) reported in its MOT History (4 Tests).

5 common/recurring faults, the most frequent (2 times) is: Nearside Front Seat belt stitching slightly frayed (5.2.2b).

50% (2) MOT Pass Rate and a 50% (2) MOT Failure Rate.

34,660 recorded miles.

MOT PASS/Failure rate for 674 CPX

all MOT test results for 674 CPX represented as a percentage
MOT PASS/Failure rate for 674 CPX
all MOT test results for 674 CPX represented as a percentage

PERCENTAGE OF VEHICLE FAULTS WITH 674 CPX

ALL REPORTED FAULTS, DISPLAYED BY PERCENTAGE OF OCCURRENCE DURING ALL MOT TESTS
PERCENTAGE OF VEHICLE FAULTS WITH 674 CPX
ALL REPORTED FAULTS, DISPLAYED BY PERCENTAGE OF OCCURRENCE DURING ALL MOT TESTS
ADVISORY

FAIL

674 CPX annual Faults by type

ALL REPORTED FAULTS, DISPLAYED over time and categorised by type
674 CPX annual Faults by type
ALL REPORTED FAULTS, DISPLAYED over time and categorised by type

RECURRING FAULTS WITH 674 CPX

FAULTS THAT HAVE OCCURED MORE THAN ONCE DURING 674 CPX's MOT HISTORY
RECURRING FAULTS WITH 674 CPX
FAULTS THAT HAVE OCCURED MORE THAN ONCE DURING 674 CPX's MOT HISTORY
Fault Fault Test Date Test Date/Time Reference MOT Test Reference
2 Nearside front seat belt stitching slightly frayed (5.2.2b) Nearside front seat belt stitching slightly frayed (5.2.2b) 16 June 2016 [12:09] 16/06/2016 16 May 2016 [11:39] 16/05/2016 610619029820 610619029820 695140719299 695140719299
2 Oil leak Oil leak 16 June 2016 [12:09] 16/06/2016 16 May 2016 [11:39] 16/05/2016 610619029820 610619029820 695140719299 695140719299
2 Nearside front wheel bearing has slight play (2.5.a.3c) Nearside front wheel bearing has slight play (2.5.a.3c) 16 June 2016 [12:09] 16/06/2016 16 May 2016 [11:39] 16/05/2016 610619029820 610619029820 695140719299 695140719299
2 Offside front wheel bearing has slight play (2.5.a.3c) Offside front wheel bearing has slight play (2.5.a.3c) 16 June 2016 [12:09] 16/06/2016 16 May 2016 [11:39] 16/05/2016 610619029820 610619029820 695140719299 695140719299
2 Offside front suspension has slight play in a lower suspension ball joint trunnion (2.5.b.1a) Offside front suspension has slight play in a lower suspension ball joint trunnion (2.5.b.1a) 16 June 2016 [12:09] 16/06/2016 16 May 2016 [11:39] 16/05/2016 610619029820 610619029820 695140719299 695140719299

ALL 674 CPX ADVISORIES [13]

ALL ADVISORIES, ORDERED by OCCURRENCE DURING 674 CPX's MOT HISTORY
ALL 674 CPX ADVISORIES [13]
ALL ADVISORIES, ORDERED by OCCURRENCE DURING 674 CPX's MOT HISTORY
Advisory Faults | source www.vehiclestats.co.uk
Fault Fault Test Date Test Date/Time Reference MOT Test Reference
2 Nearside front seat belt stitching slightly frayed (5.2.2b) Nearside front seat belt stitching slightly frayed (5.2.2b) 16 June 2016 [12:09] 16/06/2016 16 May 2016 [11:39] 16/05/2016 610619029820 610619029820 695140719299 695140719299
2 Oil leak Oil leak 16 June 2016 [12:09] 16/06/2016 16 May 2016 [11:39] 16/05/2016 610619029820 610619029820 695140719299 695140719299
2 Nearside front wheel bearing has slight play (2.5.a.3c) Nearside front wheel bearing has slight play (2.5.a.3c) 16 June 2016 [12:09] 16/06/2016 16 May 2016 [11:39] 16/05/2016 610619029820 610619029820 695140719299 695140719299
2 Offside front wheel bearing has slight play (2.5.a.3c) Offside front wheel bearing has slight play (2.5.a.3c) 16 June 2016 [12:09] 16/06/2016 16 May 2016 [11:39] 16/05/2016 610619029820 610619029820 695140719299 695140719299
2 Offside front suspension has slight play in a lower suspension ball joint trunnion (2.5.b.1a) Offside front suspension has slight play in a lower suspension ball joint trunnion (2.5.b.1a) 16 June 2016 [12:09] 16/06/2016 16 May 2016 [11:39] 16/05/2016 610619029820 610619029820 695140719299 695140719299
1 Offside rear brake pipe slightly corroded (3.6.b.2c) Offside rear brake pipe slightly corroded (3.6.b.2c) 23 June 2017 [12:46] 23/06/2017 878976267367 878976267367
1 Offside front brake pipe slightly corroded (3.6.b.2c) Offside front brake pipe slightly corroded (3.6.b.2c) 23 June 2017 [12:46] 23/06/2017 878976267367 878976267367
1 Nearside torsion bar locating washer slightly out of position Nearside torsion bar locating washer slightly out of position 16 June 2016 [12:09] 16/06/2016 610619029820 610619029820

ALL 674 CPX Failure Faults [7]

ALL Failure faults, ORDERED by OCCURRENCE DURING 674 CPX's MOT HISTORY
ALL 674 CPX Failure Faults [7]
ALL Failure faults, ORDERED by OCCURRENCE DURING 674 CPX's MOT HISTORY
Advisory Faults | source www.vehiclestats.co.uk
Fault Fault Test Date Test Date/Time Reference MOT Test Reference
1 Offside rear outer suspension component mounting prescribed area is excessively corroded shock absorbers (2.4.a.3) Offside rear outer suspension component mounting prescribed area is excessively corroded shock absorbers (2.4.a.3) 23 June 2017 [12:46] 23/06/2017 878976267367 878976267367
1 Offside front outer suspension component mounting prescribed area is excessively corroded torsion bar (2.4.a.3) Offside front outer suspension component mounting prescribed area is excessively corroded torsion bar (2.4.a.3) 23 June 2017 [12:46] 23/06/2017 878976267367 878976267367
1 Parking brake: efficiency below requirements (3.7.b.7) Parking brake: efficiency below requirements (3.7.b.7) 16 May 2016 [11:39] 16/05/2016 695140719299 695140719299
1 Brakes imbalanced across an axle (3.7.b.5b) Brakes imbalanced across an axle (3.7.b.5b) 16 May 2016 [11:39] 16/05/2016 695140719299 695140719299
1 Exhaust has a major leak of exhaust gases (7.1.2) Exhaust has a major leak of exhaust gases (7.1.2) 16 May 2016 [11:39] 16/05/2016 695140719299 695140719299
1 Nearside rear body or chassis has excessive corrosion, seriously affecting its strength within 30cm of the body mountings spring hanger (6.1.b.2) Nearside rear body or chassis has excessive corrosion, seriously affecting its strength within 30cm of the body mountings spring hanger (6.1.b.2) 16 May 2016 [11:39] 16/05/2016 695140719299 695140719299
1 Nearside body or chassis has excessive corrosion, seriously affecting its strength within 30cm of the body mountings cross member end (6.1.b.2) Nearside body or chassis has excessive corrosion, seriously affecting its strength within 30cm of the body mountings cross member end (6.1.b.2) 16 May 2016 [11:39] 16/05/2016 695140719299 695140719299

MOT TEST: 19 July 2017 11:36:06 PASSED
MOT TEST: 19 July 2017 11:36:06 PASSED

This test (504609276911) was completed on the 19 July 2017 11:36:06 and PASSED the requirements for a valid MOT with 0 comments.

This test (504609276911) was completed on the 19 July 2017 11:36:06 and PASSED the requirements for a valid MOT with 0 comments.

Recorded mileage: 34,660

Recorded mileage: 34,660


MOT TEST: 23 June 2017 12:46:49 FAILED
MOT TEST: 23 June 2017 12:46:49 FAILED

This test (878976267367) was completed on the 23 June 2017 12:46:49 and FAILED the requirements for a valid MOT with 4 comments.

This test (878976267367) was completed on the 23 June 2017 12:46:49 and FAILED the requirements for a valid MOT with 4 comments.

Recorded mileage: 34,635

Recorded mileage: 34,635


ADVISORY

FAIL


MOT TEST: 16 June 2016 12:09:33 PASSED
MOT TEST: 16 June 2016 12:09:33 PASSED

This test (610619029820) was completed on the 16 June 2016 12:09:33 and PASSED the requirements for a valid MOT with 6 comments.

This test (610619029820) was completed on the 16 June 2016 12:09:33 and PASSED the requirements for a valid MOT with 6 comments.

Recorded mileage: 34,310

Recorded mileage: 34,310


ADVISORY


MOT TEST: 16 May 2016 11:39:52 FAILED
MOT TEST: 16 May 2016 11:39:52 FAILED

This test (695140719299) was completed on the 16 May 2016 11:39:52 and FAILED the requirements for a valid MOT with 10 comments.

This test (695140719299) was completed on the 16 May 2016 11:39:52 and FAILED the requirements for a valid MOT with 10 comments.

Recorded mileage: 34,317

Recorded mileage: 34,317


ADVISORY

FAIL