674 UXU


674UXU is registered to a Red 1963, Morris Mini with a Petrol engine. It Failed its most recent MOT Test on the 04 August 2015

23 unique faults (25 Total) reported in its MOT History (9 Tests).

2 common/recurring faults, the most frequent (2 times) is: Parking brake: efficiency below requirements (3.7.B.7).

56% (5) MOT Pass Rate and a 44% (4) MOT Failure Rate.

45,289 recorded miles.

674 UXU


674UXU is registered to a Red 1963, Morris Mini with a Petrol engine. It Failed its most recent MOT Test on the 04 August 2015

23 unique faults (25 Total) reported in its MOT History (9 Tests).

2 common/recurring faults, the most frequent (2 times) is: Parking brake: efficiency below requirements (3.7.B.7).

56% (5) MOT Pass Rate and a 44% (4) MOT Failure Rate.

45,289 recorded miles.

MOT PASS/Failure rate for 674 UXU

all MOT test results for 674 UXU represented as a percentage
MOT PASS/Failure rate for 674 UXU
all MOT test results for 674 UXU represented as a percentage

PERCENTAGE OF VEHICLE FAULTS WITH 674 UXU

ALL REPORTED FAULTS, DISPLAYED BY PERCENTAGE OF OCCURRENCE DURING ALL MOT TESTS
PERCENTAGE OF VEHICLE FAULTS WITH 674 UXU
ALL REPORTED FAULTS, DISPLAYED BY PERCENTAGE OF OCCURRENCE DURING ALL MOT TESTS
ADVISORY

FAIL

USER ENTERED

PASS WITH RECTIFICATION

674 UXU annual Faults by type

ALL REPORTED FAULTS, DISPLAYED over time and categorised by type
674 UXU annual Faults by type
ALL REPORTED FAULTS, DISPLAYED over time and categorised by type

RECURRING FAULTS WITH 674 UXU

FAULTS THAT HAVE OCCURED MORE THAN ONCE DURING 674 UXU's MOT HISTORY
RECURRING FAULTS WITH 674 UXU
FAULTS THAT HAVE OCCURED MORE THAN ONCE DURING 674 UXU's MOT HISTORY
Fault Fault Test Date Test Date/Time Reference MOT Test Reference
2 Parking brake: efficiency below requirements (3.7.b.7) Parking brake: efficiency below requirements (3.7.b.7) 31 July 2015 [10:36] 31/07/2015 04 August 2011 [15:32] 04/08/2011 336562915264 336562915264 146626511299 146626511299
2 Front brake pipe slightly corroded (3.6.b.2c) Front brake pipe slightly corroded (3.6.b.2c) 10 August 2012 [15:07] 10/08/2012 10 August 2012 [13:23] 10/08/2012 356793822209 356793822209 508313422200 508313422200

ALL 674 UXU ADVISORIES [4]

ALL ADVISORIES, ORDERED by OCCURRENCE DURING 674 UXU's MOT HISTORY
ALL 674 UXU ADVISORIES [4]
ALL ADVISORIES, ORDERED by OCCURRENCE DURING 674 UXU's MOT HISTORY
Advisory Faults | source www.vehiclestats.co.uk
Fault Fault Test Date Test Date/Time Reference MOT Test Reference
2 Front brake pipe slightly corroded (3.6.b.2c) Front brake pipe slightly corroded (3.6.b.2c) 10 August 2012 [15:07] 10/08/2012 10 August 2012 [13:23] 10/08/2012 356793822209 356793822209 508313422200 508313422200
1 Nearside front suspension arm rubber bush deteriorated but not resulting in excessive movement (2.4.g.2) Nearside front suspension arm rubber bush deteriorated but not resulting in excessive movement (2.4.g.2) 11 July 2014 [12:45] 11/07/2014 179762694151 179762694151
1 Offside front suspension arm rubber bush deteriorated but not resulting in excessive movement (2.4.g.2) Offside front suspension arm rubber bush deteriorated but not resulting in excessive movement (2.4.g.2) 11 July 2014 [12:45] 11/07/2014 179762694151 179762694151

ALL 674 UXU Failure Faults [19]

ALL Failure faults, ORDERED by OCCURRENCE DURING 674 UXU's MOT HISTORY
ALL 674 UXU Failure Faults [19]
ALL Failure faults, ORDERED by OCCURRENCE DURING 674 UXU's MOT HISTORY
Fail Faults | source www.vehiclestats.co.uk
Fault Fault Test Date Test Date/Time Reference MOT Test Reference
2 Parking brake: efficiency below requirements (3.7.b.7) Parking brake: efficiency below requirements (3.7.b.7) 31 July 2015 [10:36] 31/07/2015 04 August 2011 [15:32] 04/08/2011 336562915264 336562915264 146626511299 146626511299
1 Front brakes imbalanced across an axle (3.7.b.5b) Front brakes imbalanced across an axle (3.7.b.5b) 31 July 2015 [10:36] 31/07/2015 336562915264 336562915264
1 Nearside headlamp not working on dipped beam (1.7.5a) Nearside headlamp not working on dipped beam (1.7.5a) 10 August 2012 [13:23] 10/08/2012 508313422200 508313422200
1 Centre exhaust has a major leak of exhaust gases (7.1.2) Centre exhaust has a major leak of exhaust gases (7.1.2) 10 August 2012 [13:23] 10/08/2012 508313422200 508313422200
1 Rear fuel pipe insecure (7.2.1) Rear fuel pipe insecure (7.2.1) 10 August 2012 [13:23] 10/08/2012 508313422200 508313422200
1 Nearside steering rack gaiter insecure (2.2.d.2d) Nearside steering rack gaiter insecure (2.2.d.2d) 04 August 2011 [15:32] 04/08/2011 146626511299 146626511299
1 Offside steering rack gaiter insecure (2.2.d.2d) Offside steering rack gaiter insecure (2.2.d.2d) 04 August 2011 [15:32] 04/08/2011 146626511299 146626511299
1 Offside front tie bar/rod locating pin locking device not properly locked (2.4.g.3b) Offside front tie bar/rod locating pin locking device not properly locked (2.4.g.3b) 04 August 2011 [15:32] 04/08/2011 146626511299 146626511299
1 Offside front subframe mounting prescribed area is excessively corroded (2.4.a.3) Offside front subframe mounting prescribed area is excessively corroded (2.4.a.3) 04 August 2011 [15:32] 04/08/2011 146626511299 146626511299
1 Nearside rear sub-frame attachment bracket/mounting nut missing (2.4.g.1) Nearside rear sub-frame attachment bracket/mounting nut missing (2.4.g.1) 04 August 2011 [15:32] 04/08/2011 146626511299 146626511299
1 Offside rear brake cable has restricted free movement (3.5.1k) Offside rear brake cable has restricted free movement (3.5.1k) 04 August 2011 [15:32] 04/08/2011 146626511299 146626511299
1 Nearside rear brake pipe fouled by moving parts (3.6.b.2a) Nearside rear brake pipe fouled by moving parts (3.6.b.2a) 04 August 2011 [15:32] 04/08/2011 146626511299 146626511299
1 Nearside rear brake pipe inadequately clipped (3.6.b.1) Nearside rear brake pipe inadequately clipped (3.6.b.1) 04 August 2011 [15:32] 04/08/2011 146626511299 146626511299
1 Rear brake valve insecurely mounted (3.6.a.2a) Rear brake valve insecurely mounted (3.6.a.2a) 04 August 2011 [15:32] 04/08/2011 146626511299 146626511299
1 Rear fuel pipe leaking (7.2.3) Rear fuel pipe leaking (7.2.3) 04 August 2011 [15:32] 04/08/2011 146626511299 146626511299
1 Exhaust system not adequately supported (7.1.1) Exhaust system not adequately supported (7.1.1) 04 August 2011 [15:32] 04/08/2011 146626511299 146626511299
1 Offside rear brake recording little or no effort (3.7.b.5a) Offside rear brake recording little or no effort (3.7.b.5a) 04 August 2011 [15:32] 04/08/2011 146626511299 146626511299
1 Offside rear parking brake recording little or no effort (3.7.b.6a) Offside rear parking brake recording little or no effort (3.7.b.6a) 04 August 2011 [15:32] 04/08/2011 146626511299 146626511299

ALL 674 UXU User Entered Faults [1]

ALL User Entered faults, ORDERED by OCCURRENCE DURING 674 UXU's MOT HISTORY
ALL 674 UXU User Entered Faults [1]
ALL User Entered faults, ORDERED by OCCURRENCE DURING 674 UXU's MOT HISTORY
Advisory Faults | source www.vehiclestats.co.uk
Fault Fault Test Date Test Date/Time Reference MOT Test Reference
1 Centre exhaust mount broke but exhaust still adequately supported Centre exhaust mount broke but exhaust still adequately supported 11 July 2014 [12:45] 11/07/2014 179762694151 179762694151

ALL 674 UXU Pass With Rectification Faults [1]

ALL Pass With Rectification faults, ORDERED by OCCURRENCE DURING 674 UXU's MOT HISTORY
ALL 674 UXU Pass With Rectification Faults [1]
ALL Pass With Rectification faults, ORDERED by OCCURRENCE DURING 674 UXU's MOT HISTORY
Pass With Rectification Faults | source www.vehiclestats.co.uk
Fault Fault Test Date Test Date/Time Reference MOT Test Reference
1 Nearside windscreen washer provides insufficient washer liquid (8.2.3) Nearside windscreen washer provides insufficient washer liquid (8.2.3) 17 July 2013 [16:37] 17/07/2013 168868993192 168868993192

MOT TEST: 04 August 2015 16:02:32 PASSED
MOT TEST: 04 August 2015 16:02:32 PASSED

This test (876986415280) was completed on the 04 August 2015 16:02:32 and PASSED the requirements for a valid MOT with 0 comments.

This test (876986415280) was completed on the 04 August 2015 16:02:32 and PASSED the requirements for a valid MOT with 0 comments.

Recorded mileage: 45,289

Recorded mileage: 45,289


MOT TEST: 31 July 2015 10:36:33 FAILED
MOT TEST: 31 July 2015 10:36:33 FAILED

This test (336562915264) was completed on the 31 July 2015 10:36:33 and FAILED the requirements for a valid MOT with 2 comments.

This test (336562915264) was completed on the 31 July 2015 10:36:33 and FAILED the requirements for a valid MOT with 2 comments.

Recorded mileage: 45,288

Recorded mileage: 45,288


FAIL


MOT TEST: 11 July 2014 12:45:01 PASSED
MOT TEST: 11 July 2014 12:45:01 PASSED

This test (179762694151) was completed on the 11 July 2014 12:45:01 and PASSED the requirements for a valid MOT with 3 comments.

This test (179762694151) was completed on the 11 July 2014 12:45:01 and PASSED the requirements for a valid MOT with 3 comments.

Recorded mileage: 45,281

Recorded mileage: 45,281


ADVISORY

USER ENTERED


MOT TEST: 17 July 2013 16:37:56 PASSED
MOT TEST: 17 July 2013 16:37:56 PASSED

This test (887038693174) was completed on the 17 July 2013 16:37:56 and PASSED the requirements for a valid MOT with 0 comments.

This test (887038693174) was completed on the 17 July 2013 16:37:56 and PASSED the requirements for a valid MOT with 0 comments.

Recorded mileage: 45,264

Recorded mileage: 45,264


MOT TEST: 17 July 2013 16:37:56 FAILED
MOT TEST: 17 July 2013 16:37:56 FAILED

This test (168868993192) was completed on the 17 July 2013 16:37:56 and FAILED the requirements for a valid MOT with 1 comments.

This test (168868993192) was completed on the 17 July 2013 16:37:56 and FAILED the requirements for a valid MOT with 1 comments.

Recorded mileage: 45,264

Recorded mileage: 45,264


PASS WITH RECTIFICATION


MOT TEST: 10 August 2012 15:07:05 PASSED
MOT TEST: 10 August 2012 15:07:05 PASSED

This test (356793822209) was completed on the 10 August 2012 15:07:05 and PASSED the requirements for a valid MOT with 1 comments.

This test (356793822209) was completed on the 10 August 2012 15:07:05 and PASSED the requirements for a valid MOT with 1 comments.

Recorded mileage: 44,988

Recorded mileage: 44,988


ADVISORY


MOT TEST: 10 August 2012 13:23:21 FAILED
MOT TEST: 10 August 2012 13:23:21 FAILED

This test (508313422200) was completed on the 10 August 2012 13:23:21 and FAILED the requirements for a valid MOT with 4 comments.

This test (508313422200) was completed on the 10 August 2012 13:23:21 and FAILED the requirements for a valid MOT with 4 comments.

Recorded mileage: 44,988

Recorded mileage: 44,988


ADVISORY

FAIL


MOT TEST: 08 August 2011 11:48:15 PASSED
MOT TEST: 08 August 2011 11:48:15 PASSED

This test (889990821248) was completed on the 08 August 2011 11:48:15 and PASSED the requirements for a valid MOT with 0 comments.

This test (889990821248) was completed on the 08 August 2011 11:48:15 and PASSED the requirements for a valid MOT with 0 comments.

Recorded mileage: 44,911

Recorded mileage: 44,911


MOT TEST: 04 August 2011 15:32:30 FAILED
MOT TEST: 04 August 2011 15:32:30 FAILED

This test (146626511299) was completed on the 04 August 2011 15:32:30 and FAILED the requirements for a valid MOT with 14 comments.

This test (146626511299) was completed on the 04 August 2011 15:32:30 and FAILED the requirements for a valid MOT with 14 comments.

Recorded mileage: 44,901

Recorded mileage: 44,901


FAIL