677 XUY


677XUY is registered to a Grey 1961, Morris Mini with a Petrol engine. It Passed its most recent MOT Test on the 02 January 2019

15 unique faults (15 Total) reported in its MOT History (9 Tests).

0 common/recurring faults.

78% (7) MOT Pass Rate and a 22% (2) MOT Failure Rate.

49,407 recorded miles.

677 XUY


677XUY is registered to a Grey 1961, Morris Mini with a Petrol engine. It Passed its most recent MOT Test on the 02 January 2019

15 unique faults (15 Total) reported in its MOT History (9 Tests).

0 common/recurring faults.

78% (7) MOT Pass Rate and a 22% (2) MOT Failure Rate.

49,407 recorded miles.

MOT PASS/Failure rate for 677 XUY

all MOT test results for 677 XUY represented as a percentage
MOT PASS/Failure rate for 677 XUY
all MOT test results for 677 XUY represented as a percentage

PERCENTAGE OF VEHICLE FAULTS WITH 677 XUY

ALL REPORTED FAULTS, DISPLAYED BY PERCENTAGE OF OCCURRENCE DURING ALL MOT TESTS
PERCENTAGE OF VEHICLE FAULTS WITH 677 XUY
ALL REPORTED FAULTS, DISPLAYED BY PERCENTAGE OF OCCURRENCE DURING ALL MOT TESTS
ADVISORY

FAIL

677 XUY annual Faults by type

ALL REPORTED FAULTS, DISPLAYED over time and categorised by type
677 XUY annual Faults by type
ALL REPORTED FAULTS, DISPLAYED over time and categorised by type

ALL 677 XUY ADVISORIES [8]

ALL ADVISORIES, ORDERED by OCCURRENCE DURING 677 XUY's MOT HISTORY
ALL 677 XUY ADVISORIES [8]
ALL ADVISORIES, ORDERED by OCCURRENCE DURING 677 XUY's MOT HISTORY
Advisory Faults | source www.vehiclestats.co.uk
Fault Fault Test Date Test Date/Time Reference MOT Test Reference
1 Nearside upper front suspension ball joint dust cover damaged, but preventing the ingress of dirt (2.4.g.2) Nearside upper front suspension ball joint dust cover damaged, but preventing the ingress of dirt (2.4.g.2) 01 November 2016 [17:53] 01/11/2016 618294074832 618294074832
1 Offside upper front suspension ball joint dust cover damaged, but preventing the ingress of dirt (2.4.g.2) Offside upper front suspension ball joint dust cover damaged, but preventing the ingress of dirt (2.4.g.2) 01 November 2016 [17:53] 01/11/2016 618294074832 618294074832
1 Nearside lower front suspension ball joint dust cover damaged, but preventing the ingress of dirt (2.4.g.2) Nearside lower front suspension ball joint dust cover damaged, but preventing the ingress of dirt (2.4.g.2) 01 November 2016 [17:53] 01/11/2016 618294074832 618294074832
1 Offside outer front constant velocity joint gaiter damaged, but preventing the ingress of dirt (2.5.c.1a) Offside outer front constant velocity joint gaiter damaged, but preventing the ingress of dirt (2.5.c.1a) 01 November 2016 [17:53] 01/11/2016 618294074832 618294074832
1 Nearside front upper front suspension ball joint dust cover deteriorated, but preventing the ingress of dirt (2.4.g.2) Nearside front upper front suspension ball joint dust cover deteriorated, but preventing the ingress of dirt (2.4.g.2) 06 November 2015 [17:11] 06/11/2015 997337225650 997337225650
1 Nearside front lower front suspension ball joint dust cover deteriorated, but preventing the ingress of dirt (2.4.g.2) Nearside front lower front suspension ball joint dust cover deteriorated, but preventing the ingress of dirt (2.4.g.2) 06 November 2015 [17:11] 06/11/2015 997337225650 997337225650
1 Offside front upper front suspension ball joint dust cover deteriorated, but preventing the ingress of dirt (2.4.g.2) Offside front upper front suspension ball joint dust cover deteriorated, but preventing the ingress of dirt (2.4.g.2) 06 November 2015 [17:11] 06/11/2015 997337225650 997337225650
1 Offside front outer c.v. Gaiter slightly perished Offside front outer c.v. Gaiter slightly perished 06 November 2015 [17:11] 06/11/2015 997337225650 997337225650

ALL 677 XUY Failure Faults [7]

ALL Failure faults, ORDERED by OCCURRENCE DURING 677 XUY's MOT HISTORY
ALL 677 XUY Failure Faults [7]
ALL Failure faults, ORDERED by OCCURRENCE DURING 677 XUY's MOT HISTORY
Fail Faults | source www.vehiclestats.co.uk
Fault Fault Test Date Test Date/Time Reference MOT Test Reference
1 Service brake: efficiency below requirements (3.7.b.7) Service brake: efficiency below requirements (3.7.b.7) 21 October 2016 [10:54] 21/10/2016 932520807468 932520807468
1 Rear brakes imbalanced across an axle axle 2 (3.7.b.5b) Rear brakes imbalanced across an axle axle 2 (3.7.b.5b) 21 October 2016 [10:54] 21/10/2016 932520807468 932520807468
1 Offside rear rear brake recording little or no effort (3.7.b.5a) Offside rear rear brake recording little or no effort (3.7.b.5a) 21 October 2016 [10:54] 21/10/2016 932520807468 932520807468
1 Nearside rear rear brake binding (3.7.b.1) Nearside rear rear brake binding (3.7.b.1) 21 October 2016 [10:54] 21/10/2016 932520807468 932520807468
1 Offside rear rear parking brake recording little or no effort (3.7.b.6a) Offside rear rear parking brake recording little or no effort (3.7.b.6a) 21 October 2016 [10:54] 21/10/2016 932520807468 932520807468
1 Nearside stop lamp not working (1.2.1b) Nearside stop lamp not working (1.2.1b) 06 May 2011 [09:52] 06/05/2011 286476521438 286476521438
1 Offside stop lamp not working (1.2.1b) Offside stop lamp not working (1.2.1b) 06 May 2011 [09:52] 06/05/2011 286476521438 286476521438

MOT TEST: 02 January 2019 12:36:00 PASSED
MOT TEST: 02 January 2019 12:36:00 PASSED

This test (177317192501) was completed on the 02 January 2019 12:36:00 and PASSED the requirements for a valid MOT with 0 comments.

This test (177317192501) was completed on the 02 January 2019 12:36:00 and PASSED the requirements for a valid MOT with 0 comments.

Recorded mileage: 49,407

Recorded mileage: 49,407


MOT TEST: 01 November 2016 17:53:40 PASSED
MOT TEST: 01 November 2016 17:53:40 PASSED

This test (618294074832) was completed on the 01 November 2016 17:53:40 and PASSED the requirements for a valid MOT with 4 comments.

This test (618294074832) was completed on the 01 November 2016 17:53:40 and PASSED the requirements for a valid MOT with 4 comments.

Recorded mileage: 49,138

Recorded mileage: 49,138


ADVISORY


MOT TEST: 21 October 2016 10:54:10 FAILED
MOT TEST: 21 October 2016 10:54:10 FAILED

This test (932520807468) was completed on the 21 October 2016 10:54:10 and FAILED the requirements for a valid MOT with 5 comments.

This test (932520807468) was completed on the 21 October 2016 10:54:10 and FAILED the requirements for a valid MOT with 5 comments.

Recorded mileage: 49,136

Recorded mileage: 49,136


FAIL


MOT TEST: 06 November 2015 17:11:20 PASSED
MOT TEST: 06 November 2015 17:11:20 PASSED

This test (997337225650) was completed on the 06 November 2015 17:11:20 and PASSED the requirements for a valid MOT with 4 comments.

This test (997337225650) was completed on the 06 November 2015 17:11:20 and PASSED the requirements for a valid MOT with 4 comments.

Recorded mileage: 49,003

Recorded mileage: 49,003


ADVISORY


MOT TEST: 28 April 2014 15:58:32 PASSED
MOT TEST: 28 April 2014 15:58:32 PASSED

This test (345818414136) was completed on the 28 April 2014 15:58:32 and PASSED the requirements for a valid MOT with 0 comments.

This test (345818414136) was completed on the 28 April 2014 15:58:32 and PASSED the requirements for a valid MOT with 0 comments.

Recorded mileage: 48,703

Recorded mileage: 48,703


MOT TEST: 12 April 2013 10:52:37 PASSED
MOT TEST: 12 April 2013 10:52:37 PASSED

This test (418952003112) was completed on the 12 April 2013 10:52:37 and PASSED the requirements for a valid MOT with 0 comments.

This test (418952003112) was completed on the 12 April 2013 10:52:37 and PASSED the requirements for a valid MOT with 0 comments.

Recorded mileage: 48,579

Recorded mileage: 48,579


MOT TEST: 26 May 2011 16:21:09 PASSED
MOT TEST: 26 May 2011 16:21:09 PASSED

This test (417996441102) was completed on the 26 May 2011 16:21:09 and PASSED the requirements for a valid MOT with 0 comments.

This test (417996441102) was completed on the 26 May 2011 16:21:09 and PASSED the requirements for a valid MOT with 0 comments.

Recorded mileage: 48,180

Recorded mileage: 48,180


MOT TEST: 06 May 2011 09:52:02 FAILED
MOT TEST: 06 May 2011 09:52:02 FAILED

This test (286476521438) was completed on the 06 May 2011 09:52:02 and FAILED the requirements for a valid MOT with 2 comments.

This test (286476521438) was completed on the 06 May 2011 09:52:02 and FAILED the requirements for a valid MOT with 2 comments.

Recorded mileage: 48,128

Recorded mileage: 48,128


FAIL


MOT TEST: 28 April 2010 08:57:30 PASSED
MOT TEST: 28 April 2010 08:57:30 PASSED

This test (221908910176) was completed on the 28 April 2010 08:57:30 and PASSED the requirements for a valid MOT with 0 comments.

This test (221908910176) was completed on the 28 April 2010 08:57:30 and PASSED the requirements for a valid MOT with 0 comments.

Recorded mileage: 47,776

Recorded mileage: 47,776